program: Gaussian 09
title: 000081741
version: EM64L-G09RevD.01
frameworkgroup: C1[X(C8H14O2)]
method: RPBEPBE
basis: SDD
operation: Freq
keyword: #pfreq=noraman
keyword: PBEPBE/SDD
title: #p freq=noraman PBEPBE/SDD
converged: YES YES NO NO
title: Mulliken charges:
elementType: O O C C C C C C C C H H H H H H H H H H H H H H
charge: -0.196640 -0.204816 0.183128 0.180646 -0.708845 -0.697539 -0.701673 -0.599212 0.234662 -0.765357 0.216700 0.249108 0.224451 0.204280 0.229618 0.225258 0.212999 0.225189 0.225636 0.249875 0.243767 0.235611 0.250031 0.283122
chargesum: 0.00000
title: Mulliken charges with hydrogens summed into heavy atoms:
elementType: O O C C C C C C C C
charge: -0.196640 -0.204816 0.183128 0.180646 -0.018586 -0.038384 -0.037849 -0.105570 0.234662 0.003408
polarizability: 1.07076361e+02 6.07867677e-01 9.27111640e+01 1.47607031e+00 1.07220071e+00 7.73741704e+01
1716.lowfreq: -16.3725 0.0003 0.0004 0.0008 6.8225 7.9467 47.3493 52.7981 80.3538
frequency: 47.2197 52.6531 80.2613 153.3729 159.5679 178.5287 221.8582 229.7555 242.5158 264.9631 317.2484 338.8997 365.6902 382.6579 445.2477 476.1702 514.7527 565.6858 635.8967 734.4991 807.1600 827.9532 896.8514 929.8466 937.6312 951.0983 968.0556 1006.7571 1024.4645 1030.6917 1059.1813 1151.4078 1191.7511 1210.0141 1219.0240 1245.0594 1279.0303 1374.7667 1377.2933 1384.2072 1406.2106 1438.4448 1447.3950 1452.8184 1456.1823 1463.0800 1466.8348 1476.2801 1482.6897 1495.5825 1596.1075 1637.7766 2978.9130 2979.4585 2982.5638 2990.8778 3022.5884 3062.1177 3075.9497 3078.2263 3080.5146 3088.9317 3091.3362 3097.4192 3118.9766 3125.1074
redmass: 4.1152 3.6318 4.7284 4.4490 1.0351 1.1483 1.5459 2.4104 1.1493 1.3676 2.8772 2.9893 2.2616 2.2195 2.5649 3.5756 3.4919 3.2697 3.3536 4.2408 3.8009 2.5487 1.8265 1.7628 1.6043 1.2238 1.8545 1.4444 1.6294 1.6675 2.1145 1.5959 2.4588 2.2630 2.9468 1.6803 2.3878 1.2513 1.1899 1.1848 1.1980 1.0823 1.0559 1.0757 1.0522 1.0491 1.0501 1.0500 1.0534 1.0711 9.1958 7.5141 1.0346 1.0373 1.0353 1.0359 1.0610 1.0952 1.1005 1.0996 1.1003 1.0999 1.0994 1.0994 1.1007 1.1011
irintensity: 5.2319 0.5956 8.1748 2.9629 0.2363 0.0248 0.1118 3.9184 0.6133 0.2709 0.6893 4.9621 0.3307 0.9869 2.2666 4.0457 7.7889 10.3993 7.4373 3.5229 0.9441 6.6079 10.9404 2.0045 2.4984 0.2385 39.7723 3.1171 15.0064 3.5048 109.8634 93.6201 72.4145 113.5313 3.6380 12.1040 11.4901 66.8532 36.3809 20.8090 13.3819 9.6727 25.3340 21.6503 2.2511 0.5568 1.5576 9.8780 27.2489 36.0364 193.4764 77.7203 28.2881 6.0855 17.2833 25.7177 3.1672 4.5956 10.1490 23.3946 20.0618 34.5944 31.9455 32.8483 12.4557 7.1806
temp: 298.150 k
press: 1.00000 atm
elementType: 8 8 6 6 6 6 6 6 6 6 1 1 1 1 1 1 1 1 1 1 1 1 1 1
symmnumber: 1
zpe: 531573.0 jmol-1
zpe.correction: 0.202465 hartree
zpe.thermalcorrener: 0.214893 hartree
zpe.thermalcorrenthalpy: 0.215837 hartree
zpe.thermalcorrgfe: 0.164191 hartree
zpe.sumelectzpe: -462.889051 hartree
zpe.sumelectthermal: -462.876623 hartree
zpe.sumelectthermalent: -462.875679 hartree
zpe.sumelectthermalfe: -462.927326 hartree
dipole: 1.2076 0.0316 1.6374
dipole: 2.0348
quadrupole: -58.9576 -71.2523 -59.2898
quadrupole: -8.0736 -2.2843 -0.6293
quadrupole: 4.2089 -8.0857 3.8768 -8.0736 -2.2843 -0.6293
hfenergy: -463.0915166 hartree
pointgroup: C01 [X(C8H14O2)]
dipole: -0.4786696 -0.3550252 -0.5345166 debye
dipolederiv: -0.5696223 -0.0988399 0.1662346 0.1242659 -0.7714289 0.3050258 0.0760059 0.2434404 -0.4234229 -0.5678152 -0.0346092 -0.0409312 -0.0404898 -0.4537674 0.234555 -0.2953651 0.3383143 -0.8409367 -0.1247566 -0.0841924 0.1220171 -0.0643734 0.0148226 0.0821087 0.1534756 0.0566449 0.016824 1.0719535 -0.1005427 -0.2864389 -0.5438573 0.905348 -0.483271 -0.3012642 -0.2990051 0.2270214 -0.0674012 0.0226658 0.0108119 0.0446836 0.0126401 0.0357094 -0.0646007 0.0190927 -0.0055205 0.0010004 0.0532772 -0.0309553 0.0156445 -0.0443413 0.0005065 0.0094944 -0.0083577 0.047344 -0.0181217 -0.0283353 -0.0093774 0.0364916 0.0121797 -0.044079 0.0677952 -0.023644 0.0440914 -0.893146 0.3484564 -0.3746618 0.2829063 -0.2116709 0.0884836 -0.3752036 0.0687124 -0.1838074 1.1567605 0.1868916 0.2433494 0.443647 0.3148537 -0.2696133 0.5684981 -0.4580833 1.0068121 -0.352419 -0.1925182 0.1081039 -0.2047086 -0.1459951 0.1359303 0.1176513 0.1541276 -0.1137051 -0.1307831 -0.0352986 0.1113717 -0.0275298 0.0989396 0.013189 0.0843125 0.0112253 0.0367218 0.0804787 0.0944374 -0.0467695 0.0978595 -0.05775 0.0292328 -0.0257167 0.0039065 0.0674619 0.0592769 -0.0791514 -0.0695088 -0.0756226 -0.0456983 -0.1004617 -0.0398757 -0.0564038 0.0049093 -0.1437856 0.0230769 0.0819293 -0.027962 0.0700502 0.0277033 0.1132019 0.0001082 0.0498837 0.0452405 -0.1002628 -0.0629205 -0.0494731 -0.0483992 -0.0721137 -0.0591307 -0.0812814 0.0376375 0.0984998 0.008984 -0.0125026 0.0237523 0.0645553 0.0269165 -0.0569671 0.0682447 -0.1300608 0.0600829 0.118262 -0.019832 0.0909605 -0.1324831 0.0011708 -0.0288547 0.0361608 0.0709683 0.0984918 -0.0166453 -0.0045551 -0.0005254 0.0698739 0.0570825 -0.0472618 0.0065323 -0.1490012 -0.1509651 -0.03061 0.0550618 -0.0097512 0.0869697 -0.0155478 0.0894246 -0.0026809 0.0576748 0.0505252 -0.0995428 0.0067992 -0.1024 -0.0188289 0.0172162 0.0125731 0.0511904 0.0616746 0.0828006 0.0126473 0.084184 -0.0107265 0.0872192 0.0032886 0.0859899 -0.0272345 -0.0133876 0.0557006 0.00818 0.0603499 0.0534952 0.0519409 -0.0939568 0.0641178 -0.0834509 0.029458 0.006705 -0.0472089 -0.0724101 -0.0572412 0.0983381 -0.0190522 -0.1212733 -0.0450418 -0.0130778 0.1512992 0.0708789 -0.0193497 0.0009546 0.042632 0.0399767 -0.0270267 0.0274829 0.1144371 unknown
polarizability: 106.2554883|-2.2125851|84.6074996|2.7586802|-8.1770617|86.2987077 unknown
InChI: InChI=1S/C8H14O2/c1-6(9)5-7(10)8(2,3)4/h5H2,1-4H3
charge 0 multiplicity 1
24 atoms
O  0.25308 0.957598 -1.166618
O  1.881143 -1.615439 1.625422
C  -1.583046 -0.203251 -0.005752
C  -0.167836 -0.096114 -0.617248
C  -1.451621 -0.553021 1.507558
C  -2.326537 1.142832 -0.175987
C  -2.370362 -1.33149 -0.740185
C  0.767681 -1.326538 -0.525714
C  1.908917 -1.078259 0.487717
C  3.025744 -0.161562 0.026882
H  -2.461299 -0.710669 1.929556
H  -0.856902 -1.465826 1.685408
H  -0.973932 0.272799 2.064896
H  -3.328456 1.077412 0.286341
H  -1.770366 1.966833 0.302913
H  -2.445921 1.402685 -1.242157
H  -1.916949 -2.327866 -0.592219
H  -2.43652 -1.134366 -1.82586
H  -3.399354 -1.369849 -0.338522
H  0.226177 -2.235235 -0.225541
H  1.211178 -1.46443 -1.528955
H  3.639796 -0.682051 -0.73401
H  3.66945 0.121926 0.873517
H  2.602137 0.73268 -0.466241
