program: Gaussian 09
title: 000081739
version: EM64L-G09RevD.01
frameworkgroup: C1[X(C12H14O2)]
method: RPBEPBE
basis: SDD
operation: Freq
keyword: #pfreq=noraman
keyword: PBEPBE/SDD
title: #p freq=noraman PBEPBE/SDD
converged: YES YES NO NO
title: Mulliken charges:
elementType: O O C C C C C C C C C C C C H H H H H H H H H H H H H H
charge: -0.258457 -0.251237 -0.605312 0.491665 0.310282 -0.249771 -0.395146 -0.396841 -0.737459 -0.239124 -0.229464 -0.241399 0.296001 -0.754495 0.206674 0.231912 0.254410 0.229499 0.225452 0.240737 0.224357 0.225071 0.226303 0.226498 0.230457 0.249285 0.245900 0.244202
chargesum: 0.00000
title: Mulliken charges with hydrogens summed into heavy atoms:
elementType: O O C C C C C C C C C C C C
charge: -0.258457 -0.251237 -0.166726 0.491665 0.310282 0.234138 -0.169694 -0.156104 -0.288031 -0.012821 -0.002966 -0.010942 0.296001 -0.015108
polarizability: 1.36731257e+02 2.99572581e+01 1.31774678e+02 1.33101486e+00 1.16857544e+01 1.29205220e+02
1716.lowfreq: -9.3760 -7.0258 -0.0005 0.0002 0.0005 6.3626 9.0201 19.2310 30.0518
frequency: -8.5771 19.0506 30.0199 38.2129 67.7837 112.6445 161.8725 168.7271 214.8398 249.9510 344.1110 361.6234 402.8543 406.1022 446.9717 481.3941 508.9861 565.4777 595.9795 616.3086 629.9294 689.0809 705.5221 716.0432 781.2697 785.4452 849.9179 865.7403 914.2438 922.1791 936.6382 968.7191 975.5743 988.6285 994.8860 1005.8963 1010.0188 1026.4018 1042.1662 1067.4754 1089.0680 1113.6176 1174.1443 1193.7119 1195.3238 1206.7809 1230.4640 1302.7187 1321.1121 1338.9040 1359.5816 1374.3624 1381.2167 1427.1922 1436.6184 1453.2058 1454.8979 1462.2835 1473.7758 1485.9322 1580.6871 1610.4680 1642.1635 1649.8937 2984.3354 3007.4590 3010.4378 3057.0126 3079.7998 3095.9379 3099.1714 3122.8681 3128.0702 3141.3532 3142.8237 3149.5478 3165.4129 3201.1906
redmass: 1.0877 5.7364 4.7773 4.1339 3.4864 4.0151 3.9675 4.6258 3.1575 2.7087 3.6526 2.8744 2.6970 2.8176 2.7670 3.2322 3.1798 2.9969 4.2486 6.2394 3.1310 1.4521 1.2662 4.1783 3.1352 1.9318 1.2532 2.0592 3.1620 1.5912 1.4236 2.0673 1.4216 5.2945 1.3401 2.1490 1.6447 2.4390 1.6680 2.4349 1.6761 2.2128 1.0530 1.1890 1.1347 3.2249 1.2111 2.0443 1.4169 1.7060 1.3644 6.0394 1.2717 1.4817 1.6856 1.0637 1.0472 1.1245 1.0793 2.2482 5.5005 6.0441 5.0425 9.1405 1.0640 1.0370 1.0583 1.0972 1.1055 1.0974 1.0625 1.0844 1.0871 1.0918 1.1010 1.0962 1.1016 1.1140
irintensity: 1.5269 0.4693 0.8235 0.3163 0.4738 0.0750 5.2189 6.5259 4.5444 2.0853 3.9813 0.7990 0.5981 0.1276 5.9110 14.3805 2.2774 3.1045 6.0126 0.0267 1.3585 3.9674 61.4513 2.1658 2.9566 50.8135 0.5348 2.6926 29.6966 30.0322 44.5532 5.9668 0.2454 0.4206 0.9308 83.2107 22.9166 7.6189 9.7813 25.1499 8.2507 2.8504 0.0229 3.3349 14.4425 339.4412 10.5609 8.4856 3.3245 1.7722 0.8728 1.8010 55.3010 14.3036 0.0638 26.8320 17.0093 24.7528 10.2437 11.5970 4.6551 2.1573 21.5361 188.6141 16.9530 1.4765 26.5719 10.4628 40.5246 8.7251 4.9859 4.7307 0.1629 18.7437 10.9760 40.3458 18.8489 20.7925
temp: 298.150 k
press: 1.00000 atm
elementType: 8 8 6 6 6 6 6 6 6 6 6 6 6 6 1 1 1 1 1 1 1 1 1 1 1 1 1 1
symmnumber: 1
zpe: 598206.0 jmol-1
zpe.correction: 0.227845 hartree
zpe.thermalcorrener: 0.241110 hartree
zpe.thermalcorrenthalpy: 0.242054 hartree
zpe.thermalcorrgfe: 0.185277 hartree
zpe.sumelectzpe: -615.077350 hartree
zpe.sumelectthermal: -615.064085 hartree
zpe.sumelectthermalent: -615.063141 hartree
zpe.sumelectthermalfe: -615.119918 hartree
dipole: -0.6870 1.5384 0.5597
dipole: 1.7754
quadrupole: -80.7343 -87.9498 -73.8935
quadrupole: 11.4248 4.0306 -2.9025
quadrupole: 0.1249 -7.0906 6.9657 11.4248 4.0306 -2.9025
hfenergy: -615.305195 hartree
pointgroup: C01 [X(C12H14O2)]
dipole: 0.2703116 -0.4674891 0.4430075 debye
polarizability: 134.7063588|28.8015257|127.3314059|-11.491753|-8.2458296|135.6733908 unknown
InChI: InChI=1S/C12H14O2/c1-10(8-9-14-11(2)13)12-6-4-3-5-7-12/h3-7H,1,8-9H2,2H3
charge 0 multiplicity 1
28 atoms
O  -2.369825 -0.449661 -0.132996
O  -3.246057 1.267628 -1.443276
C  -0.464064 -1.856153 -0.685601
C  0.420573 -1.471797 0.498244
C  1.432576 -0.38688 0.303485
C  -1.362358 -0.721817 -1.198588
C  2.049265 -0.164267 -0.960154
C  1.808054 0.462482 1.383432
C  0.285547 -2.119744 1.689966
C  3.021281 0.845563 -1.130871
C  2.778247 1.471918 1.215397
C  3.393435 1.668356 -0.043637
C  -3.263579 0.59675 -0.386405
C  -4.214542 0.77042 0.778377
H  0.15955 -2.189704 -1.539773
H  -1.099622 -2.715729 -0.407972
H  -0.799877 0.206842 -1.400003
H  -1.899187 -1.011838 -2.120511
H  1.790695 -0.799209 -1.815126
H  1.313088 0.342808 2.353533
H  -0.476702 -2.893189 1.833158
H  0.9368 -1.908525 2.545328
H  3.487924 0.989329 -2.111886
H  3.045181 2.115117 2.061631
H  4.143112 2.456137 -0.176681
H  -3.647723 0.961797 1.705688
H  -4.796725 -0.154333 0.934805
H  -4.896564 1.6087 0.576834
