program: Gaussian 09
title: 000081775
version: EM64L-G09RevD.01
frameworkgroup: C1[X(C8H18S7)]
method: RPBEPBE
basis: SDD
operation: Freq
keyword: #pfreq=noraman
keyword: PBEPBE/SDD
title: #p freq=noraman PBEPBE/SDD
converged: YES YES NO NO
title: Mulliken charges:
elementType: S S S S S S S C C C C C C C C H H H H H H H H H H H H H H H H H H
charge: 0.048183 0.048175 -0.045151 -0.045131 -0.041841 -0.041857 -0.014273 -0.094880 -0.094684 -0.630041 -0.657004 -0.628504 -0.630041 -0.657060 -0.628759 0.230189 0.210850 0.241049 0.229190 0.236783 0.225191 0.233284 0.209530 0.240294 0.230165 0.210850 0.241023 0.229188 0.236765 0.225199 0.233261 0.209533 0.240524
chargesum: 0.00000
title: Mulliken charges with hydrogens summed into heavy atoms:
elementType: S S S S S S S C C C C C C C C
charge: 0.048183 0.048175 -0.045151 -0.045131 -0.041841 -0.041857 -0.014273 -0.094880 -0.094684 0.052048 0.034159 0.054604 0.051997 0.034091 0.054559
polarizability: 2.96479998e+02 3.92872851e-02 2.90733416e+02 -1.24581010e-01 -1.20320276e-03 1.71205834e+02
1716.lowfreq: -9.9495 -0.0026 -0.0024 -0.0022 1.7211 6.4889 16.2136 16.9107 26.6844
frequency: 15.5598 16.6365 26.6774 28.8959 34.6450 45.9456 50.3184 62.7641 88.5927 120.5871 121.6769 152.2796 164.2739 187.7641 200.0304 200.9283 204.0508 256.5520 257.0753 264.3731 265.1037 269.7245 272.5535 276.3996 287.7759 287.9831 328.2427 345.1263 345.5868 374.1343 376.1791 384.7047 385.2119 391.0552 391.1679 432.1271 433.8993 502.1632 502.3548 785.2163 785.2529 928.0133 928.0940 929.3456 929.4254 951.0780 951.3272 1012.7011 1013.3977 1020.8983 1021.0787 1153.4081 1157.1865 1230.9104 1230.9291 1239.2660 1239.6648 1374.6183 1376.0606 1380.1659 1380.5107 1403.1639 1405.0881 1446.0293 1447.3680 1457.9221 1459.6070 1460.2913 1460.6181 1470.8255 1470.8940 1472.5462 1474.1291 1488.4858 1489.4900 2972.7078 2972.8379 2973.7415 2973.7690 2978.1660 2978.6395 3066.7094 3066.9096 3068.4109 3068.4534 3074.0567 3074.2410 3082.5071 3082.7824 3091.8754 3092.5715 3095.4789 3095.8954
redmass: 4.9493 3.8610 4.5519 5.1843 3.8170 6.9897 5.5095 7.1705 8.4735 13.6270 9.3253 8.1228 7.5320 9.3764 1.0510 1.0737 8.0260 1.1029 1.0937 1.2727 1.3010 6.2610 2.0591 2.6961 2.8634 2.8641 22.5644 3.2164 3.3165 28.4678 24.9664 2.4952 2.4800 3.2325 3.2141 8.3355 8.8452 3.1450 3.1405 3.2874 3.2842 1.5311 1.5303 1.5532 1.5526 1.2067 1.2066 1.4673 1.4641 1.4300 1.4305 1.8735 1.8773 3.0416 3.0414 3.0521 3.0455 1.1968 1.1979 1.2096 1.2090 1.1991 1.1973 1.0469 1.0468 1.0484 1.0481 1.0482 1.0488 1.0524 1.0524 1.0519 1.0513 1.0510 1.0519 1.0370 1.0370 1.0354 1.0354 1.0368 1.0367 1.0973 1.0973 1.0983 1.0984 1.0972 1.0971 1.1007 1.1007 1.1005 1.1004 1.1003 1.1002
irintensity: 0.1296 1.0282 0.0134 0.4699 0.0051 0.1707 0.0050 0.2962 1.2080 0.0071 0.0731 0.7988 0.3835 1.2160 0.0583 0.0284 0.7028 0.4032 0.0629 0.4376 0.8530 1.0158 0.6192 0.1927 0.3238 0.7153 3.1905 1.5704 0.0417 2.9476 1.7791 0.1590 0.3560 3.4373 3.1850 7.7486 9.7953 5.4271 6.9352 0.0350 0.6495 0.6019 0.8306 0.8877 1.2926 0.0444 0.0060 0.1127 5.1949 0.0437 1.5113 80.9150 165.2344 0.4598 12.0738 0.3358 15.9161 36.2153 25.4525 46.4424 4.0292 15.1046 6.6932 0.9761 0.0068 0.3334 0.7641 1.4609 0.1053 18.6981 17.0147 25.8975 0.3047 29.9882 9.5637 29.7517 1.1838 13.6495 21.8377 35.5996 55.7314 7.5088 0.1021 4.4641 3.7417 51.9311 67.7329 25.2776 0.0890 38.0049 0.5037 31.1155 9.1204
temp: 298.150 k
press: 1.00000 atm
elementType: 16 16 16 16 16 16 16 6 6 6 6 6 6 6 6 1 1 1 1 1 1 1 1 1 1 1 1 1 1 1 1 1 1
symmnumber: 1
zpe: 649487.8 jmol-1
zpe.correction: 0.247377 hartree
zpe.thermalcorrener: 0.271800 hartree
zpe.thermalcorrenthalpy: 0.272744 hartree
zpe.thermalcorrgfe: 0.188756 hartree
zpe.sumelectzpe: -3100.862207 hartree
zpe.sumelectthermal: -3100.837785 hartree
zpe.sumelectthermalent: -3100.836840 hartree
zpe.sumelectthermalfe: -3100.920828 hartree
dipole: -0.0109 -5.7458 -0.0001
dipole: 5.7458
quadrupole: -139.5607 -138.9816 -148.9875
quadrupole: 0.0049 -5.5555 0.0039
quadrupole: 2.9492 3.5283 -6.4776 0.0049 -5.5555 0.0039
hfenergy: -3101.1095842 hartree
pointgroup: C01 [X(C8H18S7)]
dipole: -0.0088845 -2.2605395 0.0042522 debye
polarizability: 296.4478429|0.0315064|290.7328201|2.0148387|-0.2343908|171.2385856 unknown
InChI: InChI=1S/C8H18S7/c1-7(2,3)9-11-13-15-14-12-10-8(4,5)6/h1-6H3
charge 0 multiplicity 1
33 atoms
S  -2.30017 0.037944 -1.224639
S  2.303148 0.03051 1.22208
S  -3.030635 1.989263 -0.389158
S  3.044933 1.973464 0.377432
S  -1.442943 2.735707 1.107377
S  1.460638 2.723691 -1.12075
S  0.012596 4.075616 -0.009091
C  -2.86014 -1.287013 0.10134
C  2.850994 -1.30386 -0.099666
C  -4.393529 -1.261955 0.224258
C  -2.352468 -2.604075 -0.531817
C  -2.165938 -0.99356 1.442468
C  4.384382 -1.291532 -0.224303
C  2.333374 -2.614373 0.538995
C  2.157653 -1.009831 -1.441085
H  -4.877995 -1.48802 -0.741454
H  -4.717379 -2.01939 0.964535
H  -4.746471 -0.2743 0.570292
H  -1.252146 -2.606837 -0.636639
H  -2.803165 -2.782139 -1.524748
H  -2.63573 -3.44794 0.125998
H  -2.519086 -0.041482 1.8762
H  -2.404186 -1.80192 2.161406
H  -1.069193 -0.932041 1.331033
H  4.868097 -1.518645 0.741542
H  4.701301 -2.053717 -0.962702
H  4.744865 -0.30777 -0.573639
H  1.233064 -2.608223 0.643658
H  2.782602 -2.791729 1.532725
H  2.61027 -3.46316 -0.11519
H  2.519086 -0.06305 -1.879522
H  2.387262 -1.823546 -2.15679
H  1.06171 -0.937487 -1.328345
