program: Gaussian 09
title: 000081721
version: EM64L-G09RevD.01
frameworkgroup: C1[X(C9H18N2O3)]
method: RPBEPBE
basis: SDD
operation: Freq
keyword: #p
keyword: freq=noraman
keyword: PBEPBE/SDD
title: #p freq=noraman PBEPBE/SDD
converged: YES YES NO NO
title: Mulliken charges:
elementType: O O O N N C C C C C C C C C H H H H H H H H H H H H H H H H H H
charge: -0.275067 -0.447032 -0.215276 -0.404224 -0.561867 -0.410105 0.011281 -0.278004 -0.728978 -0.720801 0.202004 -0.100534 -0.672849 0.161243 0.218574 0.196340 0.242757 0.219485 0.217167 0.216762 0.198934 0.216616 0.201339 0.212939 0.285611 0.343991 0.270877 0.283558 0.241818 0.267442 0.212962 0.393036
chargesum: 0.00000
title: Mulliken charges with hydrogens summed into heavy atoms:
elementType: O O O N N C C C C C C C C C
charge: -0.275067 -0.053996 -0.215276 -0.060234 -0.007432 0.004808 0.254038 -0.058519 -0.096115 -0.089907 0.202004 0.185077 0.049374 0.161243
polarizability: 1.45010323e+02 1.54002505e+00 1.21119389e+02 -2.82763319e+00 4.90752861e+00 1.00005263e+02
1716.lowfreq: -33.3418 -6.7818 0.0004 0.0006 0.0008 4.2490 10.6757 21.0163 37.8426
frequency: -28.2313 20.9090 37.8350 50.1406 74.8366 75.8325 121.2168 153.0118 197.4697 206.4922 212.7608 227.1533 231.1849 238.5591 284.0813 294.0947 324.9889 337.9764 384.3490 403.4017 422.0284 473.6597 532.3047 564.8004 593.6825 605.9505 687.8791 694.6397 707.3092 761.1530 801.7298 827.5379 848.7294 908.6535 911.7204 918.3353 948.4811 956.2180 976.3383 1006.4013 1059.9669 1076.0326 1100.9969 1117.7665 1139.0252 1147.5265 1176.5821 1193.6387 1202.4142 1247.4347 1271.8502 1279.7760 1295.1091 1300.3239 1326.4550 1339.1684 1345.7797 1363.5932 1373.3421 1378.2070 1390.0996 1451.3982 1457.9509 1465.9012 1471.4015 1479.1295 1479.3683 1481.0216 1488.6117 1603.6374 1650.7160 1678.4836 2961.0966 2961.4218 2966.1092 2992.6933 2999.5890 3001.5644 3014.8243 3027.7371 3051.7866 3062.1046 3065.2106 3069.1677 3105.0980 3118.6814 3414.2294 3527.2790 3534.8763 3544.0744
redmass: 2.6285 4.3876 9.1159 3.9370 3.6382 3.8384 4.2965 3.6630 2.1639 1.3793 2.2059 1.1886 1.1882 1.3023 2.8909 4.0365 3.3787 2.5351 2.2053 2.5920 2.7636 3.1349 3.4147 3.4065 1.2225 1.2855 2.3127 4.0172 4.5671 2.7977 2.9026 2.6707 1.6727 2.1759 1.5015 1.9140 2.0944 1.5930 2.1132 1.8625 1.2789 2.5670 2.1030 2.2872 2.2504 2.2138 1.8128 1.9351 1.6622 1.3598 1.4459 1.6067 2.0658 1.2614 1.4154 1.5095 1.3702 1.3263 1.2174 1.1979 1.2152 1.0833 1.3294 1.0497 1.0531 1.1098 1.3249 1.0714 1.0524 6.8750 1.0870 9.0960 1.0449 1.0431 1.0439 1.0848 1.0352 1.0838 1.0818 1.1006 1.0988 1.0983 1.0987 1.0986 1.1012 1.1015 1.0453 1.0644 1.0949 1.0780
irintensity: 0.3074 0.5624 2.2256 2.5449 1.5978 1.5434 1.3436 1.7148 1.6695 0.3270 8.0023 10.0783 4.0231 35.6763 12.7535 3.1042 27.9234 2.5687 0.7463 1.3606 1.5976 7.2237 45.8466 12.5942 124.0684 70.9314 76.3187 49.0631 11.6733 118.1421 92.9395 23.1639 3.3195 9.8006 2.9353 2.8898 1.5910 1.0368 25.8133 146.2956 2.4272 5.8714 69.3849 38.3424 8.1089 20.9474 21.6248 19.1683 20.5439 4.2790 11.2178 14.2241 40.2044 2.2384 3.6217 1.9946 2.3370 11.2176 18.0196 25.6934 12.6264 3.2098 183.8696 3.2850 7.9135 23.9550 133.0766 18.4168 13.5832 122.9700 42.1601 237.9541 36.3585 21.8449 31.9542 13.0858 16.8877 5.6662 10.8777 32.5479 16.0282 61.2666 55.5044 76.4213 20.2575 8.0398 1.5559 30.4008 2.6842 50.1968
temp: 298.150 k
press: 1.00000 atm
elementType: 8 8 8 7 7 6 6 6 6 6 6 6 6 6 1 1 1 1 1 1 1 1 1 1 1 1 1 1 1 1 1 1
symmnumber: 1
zpe: 707436.2 jmol-1
zpe.correction: 0.269448 hartree
zpe.thermalcorrener: 0.285802 hartree
zpe.thermalcorrenthalpy: 0.286747 hartree
zpe.thermalcorrgfe: 0.224385 hartree
zpe.sumelectzpe: -687.820013 hartree
zpe.sumelectthermal: -687.803659 hartree
zpe.sumelectthermalent: -687.802714 hartree
zpe.sumelectthermalfe: -687.865076 hartree
dipole: -0.1318 -2.2655 -2.7327
dipole: 3.5521
quadrupole: -96.0181 -82.7977 -86.1203
quadrupole: 0.5130 7.5481 -1.1073
quadrupole: -7.7061 5.5144 2.1917 0.5130 7.5481 -1.1073
hfenergy: -688.089461 hartree
pointgroup: C01 [X(C9H18N2O3)]
dipole: 0.1282668 -1.3002719 0.4958369 debye
polarizability: 144.237055|1.2460167|120.3016715|-6.642728|6.2402|101.5962494 unknown
InChI: InChI=1S/C9H18N2O3/c1-5(2)4-7(10)8(12)11-6(3)9(13)14/h5-7,11,13H,4,10H2,1-3H3
charge 0 multiplicity 1
32 atoms
O  0.1659 2.261953 0.258458
O  2.389783 -1.942341 -0.571495
O  4.066606 -0.645648 -1.524903
N  0.974176 0.084964 0.301242
N  -2.09189 1.429522 1.849816
C  -2.2663 0.178583 -0.28966
C  -3.624294 -0.494965 0.034443
C  -1.394171 0.479306 0.963668
C  -3.444043 -1.937636 0.563955
C  -4.531372 -0.48775 -1.21844
C  -0.021212 1.024374 0.488704
C  2.292007 0.46819 -0.226018
C  3.204565 1.111081 0.858373
C  3.015294 -0.714261 -0.85882
H  -2.445687 1.140309 -0.812442
H  -1.693143 -0.464236 -0.990015
H  -4.101521 0.111438 0.828904
H  -1.236729 -0.462605 1.525344
H  -4.424742 -2.402258 0.77663
H  -2.859433 -1.966279 1.50219
H  -2.927359 -2.570851 -0.184712
H  -4.703204 0.542232 -1.583144
H  -4.073822 -1.067587 -2.044296
H  -5.517243 -0.938019 -0.998003
H  2.137534 1.22765 -1.016841
H  0.799808 -0.907773 0.47234
H  -1.665906 1.492473 2.782895
H  -2.126796 2.363458 1.417042
H  4.170171 1.409694 0.416359
H  2.695865 2.005362 1.252447
H  3.389135 0.403852 1.685785
H  2.908722 -2.685531 -0.981305
