program: Gaussian 09
title: 000081698
version: EM64L-G09RevD.01
frameworkgroup: C1[X(C6H8O4)]
method: RPBEPBE
basis: SDD
operation: Freq
keyword: #p
keyword: freq=noraman
keyword: PBEPBE/SDD
title: #p freq=noraman PBEPBE/SDD
converged: YES YES NO NO
title: Mulliken charges:
elementType: O O O O C C C C C C H H H H H H H H
charge: -0.272819 -0.272781 -0.204663 -0.204683 0.510373 0.274094 0.274072 -0.742467 -0.742460 -0.649226 0.253094 0.270979 0.245783 0.253108 0.245794 0.270950 0.245424 0.245430
chargesum: 0.00000
title: Mulliken charges with hydrogens summed into heavy atoms:
elementType: O O O O C C C C C C
charge: -0.272819 -0.272781 -0.204663 -0.204683 0.510373 0.274094 0.274072 0.027388 0.027391 -0.158372
polarizability: 7.99332801e+01 -9.82523388e-03 1.00978478e+02 -7.12055542e+00 -6.39607063e-03 5.99706354e+01
1716.lowfreq: -11.0044 -9.5893 -1.7037 0.0005 0.0007 0.0007 24.1905 60.8791 66.5709
frequency: 24.0993 60.8704 66.5643 88.9600 91.0266 99.1652 191.7554 193.1605 320.3571 324.7233 427.7472 433.7951 515.9259 544.1870 555.0755 641.5311 654.5168 687.1782 732.1550 773.3064 885.3509 934.8935 954.2930 982.1177 1001.4702 1039.2930 1040.7039 1111.3795 1179.9971 1195.0956 1382.8561 1383.9606 1385.5914 1449.0938 1449.8689 1451.7612 1452.0932 1662.7281 1686.1973 1691.9858 3009.0895 3009.1988 3100.1278 3100.2455 3146.0022 3146.0826 3147.7544 3268.9396
redmass: 3.6933 3.4822 6.4886 1.3339 1.1151 2.5393 6.5038 5.6711 3.2976 3.7929 5.6312 2.8555 4.3342 3.1116 3.9416 4.4023 5.1592 1.3494 3.0985 3.4891 1.3745 6.1820 2.9959 2.3999 2.0757 1.6373 1.6569 2.6420 3.5601 3.4520 1.2063 1.2366 1.1797 1.0519 1.0516 1.0522 1.0527 7.2808 10.2999 9.5565 1.0374 1.0374 1.0957 1.0958 1.1019 1.1009 1.0629 1.1173
irintensity: 4.5577 4.1818 0.2958 1.7789 0.0181 8.0372 0.1956 1.4467 2.9781 3.6478 1.5614 10.4794 12.3714 6.5349 14.8690 16.6344 7.2130 0.6487 8.8766 10.7239 101.4346 73.6933 64.2777 134.8980 143.9531 10.8380 15.3625 413.0302 477.2367 7.8770 22.1703 91.5632 10.5414 37.8563 1.3867 32.6309 16.1465 30.2117 283.8645 252.3715 0.7385 0.0008 8.7225 0.4459 5.0946 12.9772 1.7414 1.8422
temp: 298.150 k
press: 1.00000 atm
elementType: 8 8 8 8 6 6 6 6 6 6 1 1 1 1 1 1 1 1
symmnumber: 1
zpe: 344968.7 jmol-1
zpe.correction: 0.131392 hartree
zpe.thermalcorrener: 0.143033 hartree
zpe.thermalcorrenthalpy: 0.143977 hartree
zpe.thermalcorrgfe: 0.092079 hartree
zpe.sumelectzpe: -533.541349 hartree
zpe.sumelectthermal: -533.529707 hartree
zpe.sumelectthermalent: -533.528763 hartree
zpe.sumelectthermalfe: -533.580662 hartree
dipole: -0.0019 0.4085 -0.0020
dipole: 0.4086
quadrupole: -44.6339 -53.8844 -66.1626
quadrupole: 0.0031 -3.3916 -0.0017
quadrupole: 10.2597 1.0092 -11.2690 0.0031 -3.3916 -0.0017
hfenergy: -533.6727402 hartree
pointgroup: C01 [X(C6H8O4)]
dipole: 0.0007778 -0.1607353 -0.0006974 debye
dipolederiv: -1.0501583 0.7210142 -0.0027991 0.7309392 -1.3865764 -0.2234665 -0.05004 -0.1427653 -0.3454729 -1.0505845 -0.7210778 -0.002923 -0.7309197 -1.3861907 0.2233809 -0.0498408 0.1432719 -0.3454599 -0.4517745 -0.0975027 -0.2412393 0.2131085 -0.6100365 -0.1525199 0.0326558 -0.4395709 -0.7744686 -0.4520798 0.0978198 -0.241335 -0.2129811 -0.61 0.1526729 0.0324487 0.4396879 -0.7739947 1.4282771 0.0002139 0.0325049 -0.0000697 1.2746889 0.0001118 0.4588078 -0.000372 0.1089828 0.8998579 -0.423913 0.3110157 -0.9010977 1.5397904 0.373152 -0.0224072 0.6611969 1.0306296 0.9006641 0.4235435 0.3112271 0.9009927 1.5394917 -0.3734539 -0.0221225 -0.661573 1.0298986 -0.1658026 0.1072909 -0.1396977 0.1435748 -0.0989521 0.0810949 -0.2425849 0.1556015 -0.1922225 -0.1663031 -0.1073902 -0.1398415 -0.1434745 -0.0987619 -0.0808691 -0.2427335 -0.1553794 -0.1919444 -0.2095402 -0.0001564 0.1736831 -0.0001021 -0.5977121 0.0000956 0.0330688 0.0002089 -0.3926781 0.0366375 -0.0485804 -0.0499713 -0.0951416 0.0084185 -0.0340359 -0.0170663 -0.0365887 0.1337647 0.0659347 -0.0188026 0.0753127 0.0018367 0.1008583 0.0510816 0.0627998 0.041674 0.0385845 0.0495977 0.0728723 0.0050585 0.0869352 0.0175283 -0.0641489 0.0451888 -0.0851136 0.0540045 0.0366454 0.0486094 -0.0498419 0.0951347 0.0083387 0.033912 -0.0169301 0.0364994 0.1338652 0.0496166 -0.0727928 0.0050485 -0.0868898 0.0175438 0.0641902 0.0451837 0.085147 0.054005 0.0660114 0.0187388 0.0752939 -0.0019241 0.1008612 -0.0511062 0.0627488 -0.0417218 0.0383929 0.0064946 0.0503715 -0.0607346 0.0640706 0.0903376 0.0052277 -0.0545305 -0.0100729 0.1970732 0.0065062 -0.0502585 -0.0607611 -0.0639919 0.0903724 -0.0053192 -0.0546463 0.0098701 0.1970399 unknown
polarizability: 78.0250581|-0.0020411|100.978483|9.2278981|0.0023546|61.8788528 unknown
InChI: InChI=1S/C6H8O4/c1-4(7)9-6(3)10-5(2)8/h3H2,1-2H3
charge 0 multiplicity 1
18 atoms
O  -1.124995 -0.62399 -0.464666
O  1.124546 -0.624597 0.465418
O  -1.124911 1.005279 1.23724
O  1.123755 1.004983 -1.236084
C  -0.000461 -1.341985 0.000523
C  -1.58893 0.573986 0.168799
C  1.588389 0.573403 -0.168029
C  -2.673075 1.177714 -0.685314
C  2.673552 1.176438 0.685278
C  -0.000639 -2.691314 0.000096
H  -3.393254 0.4067 -1.003995
H  -2.214338 1.599364 -1.597975
H  -3.184472 1.976746 -0.129846
H  3.393773 0.405069 1.003015
H  3.184709 1.97548 0.129601
H  2.215807 1.597915 1.598511
H  0.899899 -3.238803 0.282073
H  -0.901255 -3.238387 -0.282443
