program: Gaussian 09
title: 000081704
version: EM64L-G09RevD.01
frameworkgroup: C1[X(C12H12O4)]
method: RPBEPBE
basis: SDD
operation: Freq
keyword: #pfreq=noraman
keyword: PBEPBE/SDD
title: #p freq=noraman PBEPBE/SDD
converged: NO YES NO NO
title: Mulliken charges:
elementType: O O O O C C C C C C C C C C C C H H H H H H H H H H H H
charge: -0.255320 -0.286313 -0.436368 -0.264076 0.237507 -0.035206 0.144289 0.279385 -0.503905 -0.330482 0.168771 -0.764304 0.312211 -0.383241 -0.216370 -0.676662 0.298515 0.252738 0.239383 0.257890 0.258005 0.221438 0.228048 0.227984 0.212318 0.230660 0.230691 0.352416
chargesum: 0.00000
title: Mulliken charges with hydrogens summed into heavy atoms:
elementType: O O O O C C C C C C C C C C C C
charge: -0.255320 -0.286313 -0.083952 -0.264076 0.237507 -0.035206 0.144289 0.279385 -0.205390 -0.077744 0.168771 -0.009026 0.312211 -0.161803 0.239661 -0.002993
polarizability: 1.91356587e+02 -1.39604370e+01 1.81755063e+02 4.93955093e-02 2.98862853e-02 7.10133997e+01
1716.lowfreq: -81.6151 -4.5613 -3.9638 0.0004 0.0006 0.0009 6.5032 31.1136 70.3277
frequency: -81.6109 31.0635 70.3272 73.0289 87.6252 104.6428 155.7355 189.0627 215.0569 227.9961 250.0841 297.2662 317.4811 320.1140 354.8521 381.6130 383.6637 409.6107 434.5356 437.3425 551.7472 592.3933 595.4611 624.3168 677.6398 719.1869 756.3428 757.3648 783.7938 789.1291 798.9893 828.8790 850.4966 894.1579 915.4878 930.1921 990.6535 1017.4782 1035.5196 1044.7629 1099.4521 1112.5736 1131.7551 1135.6948 1159.8813 1185.3818 1227.3719 1244.4589 1248.3467 1271.2670 1336.6532 1370.0889 1400.3981 1403.8606 1417.8604 1444.5601 1450.3392 1456.7708 1464.5875 1473.5654 1486.6421 1490.3712 1581.3325 1596.5107 1611.5862 1641.5284 2995.2526 2999.4444 3009.3741 3067.5555 3077.3318 3091.4550 3106.7184 3118.3003 3127.5908 3177.3586 3205.5121 3587.4810
redmass: 1.0148 2.9491 3.3607 4.2200 4.8314 3.6998 3.0619 5.1986 4.7584 3.0608 1.2978 5.8544 4.9536 1.1451 4.9637 6.8352 5.4434 4.4835 5.9047 3.0311 4.7616 3.9132 5.4288 5.1141 6.5689 6.5828 7.4059 5.4743 1.5046 6.8858 1.1073 3.9972 7.2823 1.4359 1.3367 2.5382 2.9748 2.1047 1.4777 3.7004 2.4408 2.2280 1.5572 1.4648 1.8957 1.9950 3.5274 3.6964 1.1347 1.7210 2.1337 2.0995 1.2824 1.3976 3.4572 1.0436 3.4949 1.1596 1.0401 1.0650 1.1927 2.7181 9.5221 8.1685 10.6066 8.0372 1.0358 1.0369 1.0581 1.1066 1.0963 1.0985 1.1026 1.1006 1.0899 1.0956 1.0932 1.0661
irintensity: 0.1817 0.7579 2.3681 0.6182 0.5962 6.2280 0.1520 0.3600 1.0312 3.7043 0.1616 16.9286 0.0575 144.5123 7.1033 1.9918 0.4962 8.9227 0.5247 5.1036 1.0577 12.7534 1.3434 0.7610 3.5536 7.6680 32.2515 4.7210 54.2722 16.5737 3.4564 0.9943 1.5236 20.4214 4.9627 83.9536 58.6233 0.3369 7.0630 287.3818 48.1423 2.0586 247.7572 5.6138 83.0726 30.5862 67.6013 2.5362 0.0021 60.6473 81.2602 49.9712 12.5685 2.4976 74.1837 17.6834 42.9857 6.2645 12.4825 9.6155 20.1586 17.9359 145.1891 41.8861 272.1748 61.3380 19.2672 5.9624 22.8978 8.1563 4.7139 34.3185 44.4093 11.0475 13.5108 4.3981 2.6398 40.8515
temp: 298.150 k
press: 1.00000 atm
elementType: 8 8 8 8 6 6 6 6 6 6 6 6 6 6 6 6 1 1 1 1 1 1 1 1 1 1 1 1
symmnumber: 1
zpe: 561654.5 jmol-1
zpe.correction: 0.213923 hartree
zpe.thermalcorrener: 0.228548 hartree
zpe.thermalcorrenthalpy: 0.229492 hartree
zpe.thermalcorrgfe: 0.171680 hartree
zpe.sumelectzpe: -764.213508 hartree
zpe.sumelectthermal: -764.198883 hartree
zpe.sumelectthermalent: -764.197939 hartree
zpe.sumelectthermalfe: -764.255751 hartree
dipole: 1.7829 -0.9041 0.0036
dipole: 1.9990
quadrupole: -75.5432 -87.2471 -94.8739
quadrupole: 1.6212 0.0048 -0.0078
quadrupole: 10.3449 -1.3591 -8.9858 1.6212 0.0048 -0.0078
hfenergy: -764.4274308 hartree
pointgroup: C01 [X(C12H12O4)]
dipole: 0.713189 0.331513 -0.0015409 debye
polarizability: 192.2992186|13.5998053|180.8123951|-0.0729469|0.0439148|71.0134367 unknown
InChI: InChI=1S/C12H12O4/c1-3-15-12(14)11-7(2)16-10-5-4-8(13)6-9(10)11/h4-6,13H,3H2,1-2H3
charge 0 multiplicity 1
28 atoms
O  1.182651 -2.351839 -0.001396
O  -2.063402 0.988284 0.00269
O  2.621415 3.035283 0.002496
O  -2.988021 -1.158839 0.002427
C  0.659287 -0.08233 0.001705
C  -0.577707 -0.862788 0.002627
C  1.71726 -1.034232 -0.000688
C  -0.218517 -2.213385 0.000504
C  0.974397 1.294615 0.002777
C  3.073803 -0.698715 -0.002109
C  -1.971933 -0.41126 0.00513
C  -1.006905 -3.478514 0.000153
C  2.339377 1.653729 0.001362
C  3.380944 0.680511 -0.001046
C  -3.451238 1.542635 0.000763
C  -3.317254 3.061948 -0.001637
H  0.198416 2.060836 0.004673
H  3.85671 -1.461179 -0.003937
H  -0.330045 -4.347543 -0.002321
H  -1.668559 -3.527361 0.882821
H  -1.67183 -3.524826 -0.88018
H  4.430425 1.000435 -0.002071
H  -3.976799 1.161298 -0.893351
H  -3.978043 1.16421 0.895381
H  -4.320534 3.525712 -0.003103
H  -2.774983 3.412105 0.893296
H  -2.77372 3.409171 -0.896946
H  3.597504 3.193937 0.001377
