program: Gaussian 09
title: 000081778
version: EM64L-G09RevD.01
frameworkgroup: C1[X(C9H12ClO3PS2)]
method: RPBEPBE
basis: SDD
operation: Freq
keyword: #p
keyword: freq=noraman
keyword: PBEPBE/SDD
title: #p freq=noraman PBEPBE/SDD
converged: YES YES NO NO
title: Mulliken charges:
elementType: Cl S S P O O O C C C C C C C C C H H H H H H H H H H H H
charge: -0.049344 -0.000326 0.273201 1.119553 -0.509172 -0.475246 -0.594004 -0.223718 -0.873497 -0.210870 -0.191111 -0.194419 -0.194860 -0.094623 -0.479397 -0.479149 0.349872 0.322818 0.261412 0.258048 0.260579 0.259761 0.246998 0.248795 0.235100 0.230170 0.249787 0.253640
chargesum: 0.00000
title: Mulliken charges with hydrogens summed into heavy atoms:
elementType: Cl S S P O O O C C C C C C C C C
charge: -0.049344 -0.000326 0.273201 1.119553 -0.509172 -0.475246 -0.594004 -0.223718 -0.200807 0.050542 0.066936 0.066160 0.064901 -0.094623 0.251497 0.254449
polarizability: 2.59830206e+02 -7.54073234e+00 1.64899676e+02 1.31984593e+01 4.78805697e+00 1.25846354e+02
1716.lowfreq: -8.5039 -4.8686 0.0026 0.0028 0.0028 4.1858 14.2573 19.9688 22.2342
frequency: 11.9666 19.8195 21.9406 27.7493 56.7208 68.2136 72.2286 94.1796 105.8962 132.0068 138.0214 162.0855 194.5607 204.9072 222.4728 237.7357 267.1532 293.9304 299.9441 330.0143 345.3188 350.4251 384.4207 410.9430 432.1115 491.6591 504.3785 583.7060 614.1516 619.5970 640.5273 679.0408 702.3221 715.4546 818.1483 827.2438 844.3235 952.1659 964.5620 966.9543 970.1764 991.6555 1043.9039 1067.3242 1073.1011 1097.1976 1112.0609 1116.2253 1127.8391 1130.2682 1173.1112 1177.1559 1244.2198 1280.6082 1357.8522 1376.6920 1382.0884 1422.1807 1426.4537 1454.2115 1457.0167 1458.0398 1469.9932 1471.5470 1573.6864 1577.4519 2983.8544 2984.3499 3034.1491 3088.4192 3092.1931 3133.3091 3136.3627 3136.6950 3151.7512 3158.3896 3174.0165 3178.8719
redmass: 6.1621 5.4389 5.1611 7.8234 7.9696 3.5221 3.1650 1.2876 3.8447 3.5659 1.2684 4.0925 5.2032 5.0522 5.3943 6.2639 11.6024 6.0785 14.8954 5.0351 5.4454 8.1156 7.4036 2.8871 9.8222 4.4318 4.4975 8.3068 9.7140 7.1708 8.8767 10.8094 3.7898 7.1725 1.4269 1.2428 1.6123 1.3368 10.9258 1.3831 11.0582 5.7579 15.9067 5.5775 2.0600 1.3631 1.2431 1.2452 1.2854 1.2934 1.0295 1.1137 1.0967 1.2368 4.7085 3.7793 1.0917 1.1209 1.1201 2.1971 1.0503 1.0506 1.0537 1.0529 6.3894 7.9616 1.0313 1.0308 1.0562 1.1044 1.1021 1.1033 1.1095 1.1047 1.0892 1.0888 1.0968 1.0979
irintensity: 0.3706 0.5565 1.4341 0.4265 1.3836 2.9177 7.9333 0.7558 2.9883 4.6037 1.2277 1.7410 0.6734 4.0074 2.0765 11.1299 3.1397 0.4840 3.7106 0.7252 9.7938 3.1444 63.7060 0.0622 134.1922 24.1757 25.4849 62.2485 226.0908 0.5757 14.2255 108.4149 1.4774 10.5407 46.7027 0.5052 44.2772 0.8878 203.2763 2.0521 101.8055 66.1404 101.8614 34.5139 14.7479 8.1532 0.6612 0.1725 0.6863 0.1542 8.3117 1.8415 44.0046 0.6684 0.1821 4.9240 16.9010 4.9360 3.1960 76.8864 12.4417 13.7884 13.0931 18.0456 18.4745 1.0348 48.5458 28.1505 6.0875 23.5020 27.7416 11.0886 7.0250 7.5977 1.2934 2.5131 5.0815 0.7638
temp: 298.150 k
press: 1.00000 atm
elementType: 17 16 16 15 8 8 8 6 6 6 6 6 6 6 6 6 1 1 1 1 1 1 1 1 1 1 1 1
symmnumber: 1
zpe: 514953.0 jmol-1
zpe.correction: 0.196135 hartree
zpe.thermalcorrener: 0.216040 hartree
zpe.thermalcorrenthalpy: 0.216984 hartree
zpe.thermalcorrgfe: 0.142336 hartree
zpe.sumelectzpe: -2171.980821 hartree
zpe.sumelectthermal: -2171.960916 hartree
zpe.sumelectthermalent: -2171.959972 hartree
zpe.sumelectthermalfe: -2172.034620 hartree
dipole: 0.0465 -2.1888 2.6939
dipole: 3.4713
quadrupole: -132.2725 -117.7626 -122.0914
quadrupole: 15.3285 -11.5059 10.6691
quadrupole: -8.2304 6.2795 1.9508 15.3285 -11.5059 10.6691
hfenergy: -2172.1769562 hartree
pointgroup: C01 [X(C9H12Cl1O3P1S2)]
dipole: 0.2732971 -1.0893693 -0.7770132 debye
polarizability: 248.3018668|32.1877782|169.3955593|19.7665288|-9.7450201|132.8788108 unknown
InChI: InChI=1S/C7H6ClS2.C2H6O3P/c8-6-1-3-7(4-2-6)10-5-9;1-4-6(3)5-2/h1-4H,5H2;1-2H3
charge 0 multiplicity 1
28 atoms
Cl -5.185296 -2.35841 -0.38032
S  1.566806 0.125233 -0.668546
S  -0.610263 2.11039 0.608574
P  3.367315 1.098294 0.440809
O  4.690929 0.123584 -0.110483
O  3.346145 0.626587 2.088741
O  3.445172 2.66899 0.225319
C  -1.901772 0.826388 0.302151
C  0.553112 1.726663 -0.814935
C  -3.008534 1.120276 -0.529105
C  -1.801892 -0.436349 0.932133
C  -4.014997 0.15052 -0.742731
C  -2.80181 -1.414714 0.725715
C  -3.890891 -1.10296 -0.11125
C  5.183913 0.330571 -1.491985
C  3.217666 -0.806558 2.441876
H  1.256531 2.573864 -0.874527
H  -0.02105 1.61741 -1.746314
H  -3.091311 2.104706 -1.000665
H  -0.948521 -0.653377 1.581006
H  -4.87569 0.369228 -1.381021
H  -2.732916 -2.394232 1.207102
H  5.994941 -0.402605 -1.610369
H  5.572027 1.356369 -1.614848
H  4.381268 0.132591 -2.226334
H  2.29578 -1.233537 2.004145
H  3.153849 -0.810458 3.539633
H  4.103189 -1.367761 2.09993
