program: Gaussian 09
title: 000081862
version: EM64L-G09RevD.01
frameworkgroup: C1[X(C20H20Cl3N3O2)]
method: RPBEPBE
basis: SDD
operation: Freq
keyword: #p
keyword: freq=noraman
keyword: PBEPBE/SDD
title: #p freq=noraman PBEPBE/SDD
converged: YES YES NO NO
title: Mulliken charges:
elementType: Cl Cl Cl O O N N N C C C C C C C C C C C C C C C C C C C C H H H H H H H H H H H H H H H H H H H H
charge: -0.017562 -0.016309 -0.000661 -0.288366 -0.240589 -0.144010 -0.080430 -0.108918 -0.476879 0.475380 -0.397267 -0.579550 -0.246615 0.412409 -0.344105 -0.664076 -0.057734 -0.318731 -0.807201 0.275535 0.304425 -0.295317 -0.239559 -0.215885 -0.064863 -0.198182 -0.104790 -0.465544 0.236627 0.246185 0.227648 0.254815 0.238210 0.260278 0.236350 0.228264 0.220961 0.242475 0.218569 0.282663 0.212412 0.243868 0.243902 0.301828 0.246525 0.282270 0.249904 0.231638
chargesum: 0.00000
title: Mulliken charges with hydrogens summed into heavy atoms:
elementType: Cl Cl Cl O O N N N C C C C C C C C C C C C C C C C C C C C
charge: -0.017562 -0.016309 -0.000661 -0.288366 -0.240589 -0.144010 -0.080430 -0.108918 0.005933 0.475380 0.085197 -0.341340 0.250012 0.412409 -0.115840 0.017930 -0.057734 -0.036069 -0.107019 0.275535 0.304425 -0.295317 0.062269 0.030641 -0.064863 0.084088 -0.104790 0.015998
polarizability: 7.01168257e+02 4.68143723e+01 2.79740316e+02 -3.15684824e+01 2.66372094e+01 1.78699208e+02
1716.lowfreq: -2.3390 -0.0011 -0.0006 0.0009 3.9079 6.2631 8.6248 12.6132 20.9728
frequency: 8.4572 12.5980 20.9501 27.9630 33.8078 43.8116 52.0386 59.2742 80.0147 87.6866 96.3591 111.8421 118.1514 127.1350 145.4968 154.9327 165.6564 181.4981 182.6941 196.6450 204.5007 215.8197 219.3259 227.6814 245.0555 252.1661 282.9815 309.0995 330.5661 349.3559 364.8609 381.4313 392.8476 412.7450 439.6494 451.6111 453.5669 476.7264 488.2716 498.2104 505.2001 534.9017 546.8366 557.1575 594.5863 608.7162 615.3516 651.1692 653.9903 672.3505 709.2750 726.7412 749.7536 777.8690 786.0228 794.7994 815.7885 817.8227 854.4772 854.6436 855.4948 893.6012 911.4281 913.5620 919.3162 942.6104 984.9070 990.6856 998.0558 1001.9317 1011.4924 1028.0673 1041.4155 1045.0775 1061.8251 1063.5352 1082.3631 1096.6585 1117.5311 1120.6095 1138.7315 1178.1311 1184.8223 1196.7349 1215.1550 1216.8111 1258.9597 1267.6636 1283.6683 1288.6276 1293.9947 1309.5824 1332.3391 1342.7256 1356.2751 1363.7927 1374.5936 1379.1062 1388.7702 1398.1279 1403.4589 1411.4601 1425.3850 1449.8622 1456.8640 1462.7508 1467.7330 1471.1215 1483.6410 1488.9920 1502.0635 1518.7189 1535.6548 1544.1638 1570.6679 1621.5119 1630.1968 1640.8204 2985.5741 2991.1955 3005.0302 3011.9734 3016.1806 3062.2896 3068.1271 3076.8702 3082.4908 3083.0127 3091.2586 3096.2524 3105.9075 3149.1402 3157.2627 3158.1174 3166.7774 3169.5523 3182.6356 3222.1239
redmass: 9.2811 7.1108 6.0295 5.9823 6.8490 6.7810 4.2133 5.8102 4.5780 3.1994 7.0692 3.7708 1.1085 4.1289 6.4947 5.2908 6.0177 5.0079 15.4583 2.3027 2.3097 2.9526 2.8227 6.2399 3.5340 2.9387 4.0180 20.3818 4.1827 5.7508 5.5486 5.1812 4.7074 3.4571 4.3141 3.6513 3.3856 3.5060 6.3900 2.8630 1.8228 4.5847 3.3655 4.2972 3.4959 5.6077 6.1523 5.6319 4.0616 5.3570 3.5934 7.2917 3.3139 3.3626 1.2375 2.8908 1.5220 3.2740 2.6905 2.0053 1.4275 4.2420 1.4970 6.9978 2.4517 2.2338 1.3474 2.2812 1.3205 1.1303 1.8700 4.7803 2.6151 1.5758 1.6385 1.9383 1.9732 1.9827 2.5520 3.8740 2.0654 3.2715 1.5552 2.6167 1.2619 1.3740 1.5413 2.8906 1.2521 1.4166 1.4746 7.1799 6.1042 1.2923 1.3365 1.5558 2.7979 8.5793 1.2349 1.3092 2.2570 1.2228 2.9838 1.7021 1.0473 1.0832 1.0474 1.1239 1.0663 1.8847 1.7436 1.4896 8.7356 6.8755 8.8590 6.1777 11.4985 4.4911 1.0357 1.0362 1.0591 1.0605 1.0630 1.1023 1.1004 1.0968 1.1021 1.1039 1.1006 1.1013 1.0600 1.0866 1.0899 1.0956 1.0907 1.0959 1.0930 1.1159
irintensity: 0.0566 0.0157 0.6631 1.3648 0.4643 0.2802 0.2933 0.3068 0.5857 0.4344 0.4397 2.2539 0.5531 1.3627 3.8612 1.7931 3.0495 1.9253 0.6916 1.4432 0.9931 3.4853 0.9325 1.2871 1.4842 1.6025 11.5178 0.7744 0.2887 2.8003 2.2610 40.2608 10.1982 6.5254 13.8534 1.5855 2.0926 18.7108 7.1560 11.1684 0.5222 22.8702 4.6404 7.6108 1.1361 18.9321 0.7278 22.2837 4.8553 8.5257 0.0127 5.9026 0.3618 21.3804 21.5770 6.7170 32.2556 1.7251 11.1741 29.4267 9.4993 45.2381 26.0715 16.3964 1.9439 11.6302 3.0941 84.0037 1.2134 88.6693 6.8535 119.0858 9.1486 11.0492 17.7799 69.8075 17.9530 213.8827 131.2370 542.1102 6.2913 29.7785 32.3907 27.6182 28.7185 2.3151 494.6473 47.9964 7.2991 35.1971 10.4802 469.0794 291.1084 16.0441 29.1780 86.7249 6.6644 3.9081 22.1291 70.0551 149.7495 82.8894 134.6662 24.0322 12.1356 6.2656 6.8162 14.4916 7.9164 25.3479 85.0729 80.3592 24.4704 12.9006 2.2911 779.4996 170.6399 24.5577 35.2701 20.9438 16.2560 46.5138 38.1852 4.2450 5.2255 11.9718 43.2878 36.6249 26.5520 51.9275 4.2693 9.5524 23.3088 5.2893 10.2251 27.0281 0.6197 7.0182
temp: 298.150 k
press: 1.00000 atm
elementType: 17 17 17 8 8 7 7 7 6 6 6 6 6 6 6 6 6 6 6 6 6 6 6 6 6 6 6 6 1 1 1 1 1 1 1 1 1 1 1 1 1 1 1 1 1 1 1 1
symmnumber: 1
zpe: 942337.7 jmol-1
zpe.correction: 0.358917 hartree
zpe.thermalcorrener: 0.387825 hartree
zpe.thermalcorrenthalpy: 0.388769 hartree
zpe.thermalcorrgfe: 0.293622 hartree
zpe.sumelectzpe: -2466.910683 hartree
zpe.sumelectthermal: -2466.881776 hartree
zpe.sumelectthermalent: -2466.880832 hartree
zpe.sumelectthermalfe: -2466.975978 hartree
dipole: 9.4467 3.0920 -0.9947
dipole: 9.9895
quadrupole: -166.7498 -184.2334 -180.5090
quadrupole: 19.2974 2.7316 3.1240
quadrupole: 10.4143 -7.0693 -3.3449 19.2974 2.7316 3.1240
hfenergy: -2467.2696003 hartree
pointgroup: C01 [X(C20H20Cl3N3O2)]
dipole: -3.7106933 -1.2816116 0.1853792 debye
polarizability: 701.0894443|55.776643|244.6938749|2.454138|-55.9636104|213.8244616 unknown
InChI: InChI=1S/C20H20Cl3N3O2/c1-4-20(27)28-9-8-26(5-2)14-6-7-18(13(3)10-14)24-25-19-12-16(22)15(21)11-17(19)23/h4,6-7,10-12H,1,5,8-9H2,2-3H3
charge 0 multiplicity 1
48 atoms
Cl 4.08672 2.385194 -2.423276
Cl 7.145254 -1.263888 1.905385
Cl 8.783356 0.929336 0.074329
O  -5.702393 0.682097 -0.026655
O  -6.039508 2.994476 -0.018608
N  -3.418156 -1.242661 -0.46864
N  2.185249 -0.592164 0.125508
N  2.77995 0.310506 -0.631618
C  -4.192492 -0.525111 -1.49713
C  -2.041405 -1.066019 -0.338774
C  -4.173597 -2.185212 0.391006
C  -1.273707 -1.848178 0.587383
C  -4.664784 0.873699 -1.077014
C  0.113164 -1.687277 0.740954
C  -1.334972 -0.089487 -1.126495
C  -4.168002 -3.636393 -0.141977
C  0.7953 -0.710131 -0.061809
C  0.041639 0.074336 -0.988497
C  0.874231 -2.543237 1.734928
C  -6.323597 1.859387 0.431761
C  4.182459 0.40724 -0.419659
C  4.921854 1.344315 -1.195127
C  4.904523 -0.378569 0.526767
C  -7.320679 1.532576 1.481776
C  6.28624 -0.231683 0.68372
C  6.311573 1.498677 -1.043609
C  6.997995 0.707922 -0.100022
C  -8.052002 2.508054 2.080624
H  -3.59998 -0.431637 -2.42557
H  -5.080712 -1.131752 -1.74944
H  -3.765094 -2.1470 1.41661
H  -5.208056 -1.807614 0.457658
H  -1.765714 -2.611466 1.196433
H  -3.846415 1.486993 -0.661222
H  -5.115571 1.417206 -1.928513
H  -1.868822 0.548582 -1.83586
H  -4.747576 -4.293923 0.531843
H  -3.141101 -4.034259 -0.216269
H  -4.625601 -3.69028 -1.146474
H  0.580331 0.81811 -1.584181
H  0.200491 -3.255991 2.240647
H  1.679532 -3.110488 1.23631
H  1.363975 -1.917721 2.502255
H  4.334978 -1.097864 1.122416
H  -7.429167 0.475186 1.743804
H  6.85778 2.224257 -1.65089
H  -7.916178 3.557599 1.79451
H  -8.788018 2.276957 2.857402
