program: Gaussian 09
title: 000081619
version: EM64L-G09RevD.01
frameworkgroup: C1[X(C9H13N3O)]
method: RPBEPBE
basis: SDD
operation: Freq
keyword: #p
keyword: freq=noraman
keyword: PBEPBE/SDD
title: #p freq=noraman PBEPBE/SDD
converged: YES YES NO NO
title: Mulliken charges:
elementType: O N N N C C C C C C C C C H H H H H H H H H H H H H
charge: -0.266311 -0.045926 -0.164598 -0.035801 0.163035 0.313210 -0.335738 -0.312149 -0.336851 -0.326033 -0.619556 -0.601975 -0.537995 0.243350 0.256431 0.247828 0.235193 0.257264 0.215233 0.255937 0.227900 0.227810 0.257622 0.219631 0.219689 0.242800
chargesum: 0.00000
title: Mulliken charges with hydrogens summed into heavy atoms:
elementType: O N N N C C C C C C C C C
charge: -0.266311 -0.045926 -0.164598 -0.035801 0.163035 0.313210 -0.092388 -0.055718 -0.089022 -0.090841 0.108877 0.111357 0.144125
polarizability: 2.60722455e+02 -3.15647830e+00 1.18452335e+02 3.32732728e-02 1.23011408e-01 6.41599969e+01
1716.lowfreq: -8.1283 -5.1651 -0.0009 -0.0008 -0.0005 0.8890 22.7746 52.9655 66.7044
frequency: 22.5382 52.8836 66.6883 88.1481 101.0642 135.6836 180.1904 202.6632 219.8839 257.8660 261.6499 311.1843 368.6050 394.8803 404.1023 419.0299 480.2664 533.1852 534.8302 583.4481 635.9562 733.3374 743.6253 812.3560 815.3078 841.1893 898.8856 952.0022 965.2882 987.8357 995.0130 1036.2041 1055.1258 1086.3251 1105.8978 1112.7626 1126.1661 1152.4117 1159.1448 1196.7555 1227.8035 1278.8706 1297.7567 1329.6236 1349.0738 1372.4296 1415.6031 1428.0950 1437.3551 1438.3290 1439.2140 1466.4254 1468.5702 1472.5356 1482.7457 1488.6601 1492.5694 1577.7246 1614.6854 2956.3336 2961.7571 2980.5184 3033.1446 3042.4675 3056.0639 3111.9841 3117.9689 3121.7221 3143.2937 3147.2864 3166.0623 3172.0642
redmass: 2.6605 2.8656 1.8586 3.9241 2.5538 1.3931 1.7355 3.4034 1.3984 2.0529 4.1207 3.7437 7.4106 5.7578 3.0004 3.2372 3.7527 2.4380 5.4756 5.1134 6.7983 3.7633 5.4873 1.2788 5.1870 1.6370 5.0939 1.3719 1.3407 8.1998 2.5671 1.4690 2.2932 1.2471 1.2755 1.2599 1.3345 1.3021 1.3881 2.6326 4.2817 2.2659 1.7729 3.7745 6.4068 5.6549 1.1504 3.6449 1.2135 1.1976 1.0980 1.0500 1.0460 1.1030 1.1488 1.3818 1.4733 7.7839 6.3281 1.0331 1.0361 1.0336 1.1017 1.1038 1.0997 1.1006 1.0970 1.0990 1.0870 1.0879 1.0952 1.0969
irintensity: 0.0199 5.9636 0.5745 3.5204 1.0000 2.6522 9.7034 0.4630 1.0103 0.4409 1.7084 0.6058 1.0379 0.0059 1.5250 0.0061 5.2016 24.4257 65.5478 5.9514 1.7484 1.8163 8.5246 6.3487 0.0222 77.6987 16.3947 1.4632 0.0137 50.1541 18.6915 38.9070 146.4054 0.1195 11.9050 0.2275 0.4758 7.1390 21.6403 62.6886 229.8308 3.8519 9.8160 86.7832 248.3755 9.0988 27.0535 1.9459 23.1794 16.5241 16.9502 13.0165 11.4189 105.8946 73.9474 112.7037 7.9228 2.2349 62.1991 89.9543 111.6981 66.5460 41.6032 53.0723 22.9692 12.5622 15.3330 30.6400 14.2785 4.7890 13.9602 7.8156
temp: 298.150 k
press: 1.00000 atm
elementType: 8 7 7 7 6 6 6 6 6 6 6 6 6 1 1 1 1 1 1 1 1 1 1 1 1 1
symmnumber: 1
zpe: 550994.7 jmol-1
zpe.correction: 0.209863 hartree
zpe.thermalcorrener: 0.223593 hartree
zpe.thermalcorrenthalpy: 0.224537 hartree
zpe.thermalcorrgfe: 0.168125 hartree
zpe.sumelectzpe: -589.181717 hartree
zpe.sumelectthermal: -589.167987 hartree
zpe.sumelectthermalent: -589.167043 hartree
zpe.sumelectthermalfe: -589.223455 hartree
dipole: 2.2215 -2.1691 0.0043
dipole: 3.1048
quadrupole: -51.0882 -70.6535 -80.7519
quadrupole: 6.1601 0.0227 0.0140
quadrupole: 16.4096 -3.1556 -13.2541 6.1601 0.0227 0.0140
hfenergy: -589.3915798 hartree
pointgroup: C01 [X(C9H13N3O1)]
dipole: -0.8661218 -0.5779491 -0.6386811 debye
dipolederiv: -2.0659824 0.2737417 0.2240886 0.2450582 -0.3563849 -0.051809 0.1954158 -0.0516852 -0.3455121 -1.8429114 -0.2066288 -0.2742359 0.058258 -0.230948 0.0417768 0.0422102 0.0339306 -0.2290197 -0.6262151 -0.0666028 -0.0856769 -0.686746 -0.2080138 -0.0885847 -0.7402813 -0.066727 -0.242169 1.7470848 0.239138 0.3122005 0.1943238 -0.1148944 -0.0644763 0.2568445 -0.0646857 -0.1093809 0.6114044 0.0266425 0.04909 0.1254441 -0.0662563 -0.0536684 0.1532901 -0.0567825 -0.0641186 1.7467477 -0.1856955 -0.1362621 0.0786001 0.0552245 -0.0304467 0.1384885 -0.0395304 0.0504113 0.0409571 0.0232135 0.0308822 -0.0449138 -0.0289257 0.1315783 -0.0385265 0.1334606 -0.0191703 0.0210517 -0.064398 -0.061739 0.0482835 -0.042968 0.0907948 0.0545028 0.0872436 -0.0368308 -0.3011978 0.0216772 0.0186173 0.2704207 -0.0878376 0.1075636 0.2774742 0.0988452 -0.0696783 -0.4819714 0.0581067 0.050578 -0.2737089 -0.0875779 0.1105868 -0.2947897 0.1222312 -0.0868059 0.2135918 -0.0321087 -0.0345324 -0.1578127 0.2008336 -0.0249068 -0.1794625 -0.0193139 0.1835262 0.4033647 0.1671328 0.1846209 0.4324782 0.2736144 0.0227559 0.4552051 0.0125542 0.2991357 0.6319235 -0.11798 -0.1121468 -0.4616101 0.4114656 0.0654238 -0.4713258 0.0775883 0.3972958 0.0674268 0.0677517 0.0675443 0.0492342 0.0571596 -0.0994818 0.0481997 -0.0988314 0.053427 0.0738741 -0.0543043 -0.0587804 -0.0434145 0.0754625 -0.0820029 -0.0470215 -0.0825256 0.0658021 0.0220734 -0.0592624 -0.0667429 -0.0649833 0.0831389 -0.0917469 -0.0724895 -0.0915003 0.0715718 0.0064144 0.0646388 0.0616531 0.0844405 0.0543904 -0.1085065 0.0824965 -0.1091476 0.0511865 0.0681658 0.0179351 -0.081619 0.0482183 0.0497506 0.0458602 0.0825888 0.0169164 -0.0956575 -0.1848572 0.0042349 -0.0007077 -0.0242342 0.1050639 -0.0146897 -0.0298363 -0.0144947 0.1057711 0.061502 -0.0842761 0.01518 0.0829375 -0.1037438 0.013487 0.056833 0.0377964 0.0528885 -0.1201147 0.0154514 -0.1430195 0.0525522 -0.0218925 0.105169 -0.2284869 0.0401006 -0.0262086 -0.1363529 -0.1436764 0.0056564 -0.2227648 -0.017118 0.0315087 0.0409762 0.0961173 -0.0104659 0.087268 0.0963734 0.0989619 0.0311077 0.0558509 -0.0768674 0.0309844 -0.0742646 0.0525386 0.0752668 0.0259418 -0.0806168 0.1016183 0.0270387 0.0326656 0.1171932 0.0140283 -0.1813838 0.071868 -0.0888041 0.0242011 0.1063357 -0.1848503 0.0088166 0.1085773 0.0186483 0.0325291 -0.1903822 0.0017576 -0.0071951 -0.0291228 0.1024177 -0.0208001 -0.0390603 -0.019972 0.1003176 unknown
polarizability: 260.5381456|-0.4270962|90.1408775|6.5090866|27.0917306|92.6557639 unknown
InChI: InChI=1S/C9H13N3O/c1-12(2)11-10-8-4-6-9(13-3)7-5-8/h4-7H,1-3H3
charge 0 multiplicity 1
26 atoms
O  4.06289 0.100204 0.295268
N  -3.641952 -0.163982 -0.245848
N  -1.594549 0.423702 0.437592
N  -2.295125 -0.33382 -0.383366
C  -0.179707 0.254501 0.309806
C  2.657647 0.098591 0.245553
C  0.614221 1.059086 1.174087
C  0.475093 -0.631594 -0.588891
C  2.016167 0.985575 1.145921
C  1.881819 -0.711996 -0.623825
C  -4.215429 0.778217 0.727047
C  -4.48662 -0.963925 -1.132724
C  4.771563 -0.796503 -0.618315
H  0.102522 1.738982 1.863244
H  -0.12948 -1.253585 -1.256254
H  2.633473 1.601062 1.807157
H  2.360768 -1.402897 -1.325005
H  -3.885791 0.525497 1.751709
H  -5.313923 0.728022 0.659122
H  -3.869268 1.808469 0.522289
H  -5.104935 -0.321217 -1.789237
H  -5.161374 -1.626454 -0.556637
H  -3.825103 -1.582645 -1.758088
H  4.550941 -0.553312 -1.676347
H  4.517419 -1.856909 -0.422651
H  5.839735 -0.628968 -0.415507
