program: Gaussian 09
title: 000081648
version: EM64L-G09RevD.01
frameworkgroup: C1[X(C8H10N4O2)]
method: RPBEPBE
basis: SDD
operation: Freq
keyword: #p
keyword: freq=noraman
keyword: PBEPBE/SDD
title: #p freq=noraman PBEPBE/SDD
converged: YES YES NO NO
title: Mulliken charges:
elementType: O O N N N N C C C C C C C C H H H H H H H H H H
charge: -0.223321 -0.223363 -0.037264 -0.157921 -0.017251 0.019741 0.180673 0.375290 -0.273126 -0.327913 -0.342656 -0.342560 -0.615835 -0.597326 0.269722 0.253655 0.282186 0.284764 0.265110 0.223467 0.264240 0.238335 0.238149 0.263202
chargesum: 0.00000
title: Mulliken charges with hydrogens summed into heavy atoms:
elementType: O O N N N N C C C C C C C C
charge: -0.223321 -0.223363 -0.037264 -0.157921 -0.017251 0.019741 0.180673 0.375290 -0.003404 -0.074258 -0.060470 -0.057796 0.136983 0.142360
polarizability: 3.09256256e+02 -2.62906439e+00 1.24138214e+02 1.57380760e-02 1.00870328e-01 5.71189350e+01
1716.lowfreq: -11.3718 -4.0257 -0.0006 -0.0004 0.0002 4.2707 28.0386 51.5988 71.7578
frequency: 28.0249 51.5929 71.7500 86.2660 99.1815 126.5785 166.3729 207.2345 232.8182 235.1584 323.4013 338.9070 386.2820 393.5174 416.5984 486.9260 508.7634 513.5848 563.6898 626.6595 664.0930 668.5172 746.7294 772.5468 815.9269 845.4632 876.9847 895.6652 990.8148 993.2886 1000.7082 1036.3401 1065.9491 1081.9714 1093.9660 1106.1113 1128.6405 1157.1773 1202.0155 1221.4998 1274.6637 1294.0572 1323.2744 1340.0569 1351.2936 1397.8371 1418.0636 1433.7764 1440.7098 1441.1682 1468.1148 1470.1628 1479.7046 1489.8376 1579.5069 1605.2839 2977.2599 2991.4251 3055.2706 3071.7903 3122.7436 3128.4134 3160.7079 3165.7552 3184.4511 3187.8219
redmass: 3.3099 5.3141 6.8310 4.7636 1.3674 1.4304 1.9798 5.5261 5.8657 2.7724 4.4752 6.0840 3.2958 6.5574 3.1340 5.9059 5.9181 3.2798 5.3442 7.1722 7.5093 4.7346 4.5999 8.4079 5.3488 1.2451 1.6906 5.0620 1.3329 2.8667 1.3411 1.4632 2.2701 1.2478 3.1888 1.2545 1.3538 1.4167 4.1066 5.0753 2.0695 2.0095 6.3231 3.3481 7.7804 6.0987 1.1638 4.7018 1.2260 1.0612 1.0453 2.1574 1.1210 1.1805 7.9187 6.5621 1.0355 1.0335 1.1019 1.0998 1.1015 1.0986 1.0893 1.0878 1.0961 1.0967
irintensity: 0.0562 0.0423 0.0017 0.1632 2.5129 3.6160 7.2792 2.8723 0.7205 1.0500 1.7834 0.0167 1.1570 1.2841 0.0579 16.2599 5.6451 10.4876 11.5459 0.2297 1.4889 27.5730 0.6036 11.4354 20.0267 0.4417 71.6962 11.3981 0.6213 0.0432 0.0803 25.3841 146.5689 0.1221 19.6972 18.6846 0.5625 184.5952 119.6141 669.5446 5.3674 5.3635 328.9960 239.8187 77.2150 31.0989 26.8485 20.1858 22.1107 20.1441 14.1326 63.9665 9.3937 55.3701 22.5287 156.7446 75.4051 54.4313 28.6289 15.1242 10.0083 11.0471 3.4948 1.0448 0.7980 1.6891
temp: 298.150 k
press: 1.00000 atm
elementType: 8 8 7 7 7 7 6 6 6 6 6 6 6 6 1 1 1 1 1 1 1 1 1 1
symmnumber: 1
zpe: 473008.6 jmol-1
zpe.correction: 0.180159 hartree
zpe.thermalcorrener: 0.193680 hartree
zpe.thermalcorrenthalpy: 0.194624 hartree
zpe.thermalcorrgfe: 0.138429 hartree
zpe.sumelectzpe: -679.137248 hartree
zpe.sumelectthermal: -679.123727 hartree
zpe.sumelectthermalent: -679.122783 hartree
zpe.sumelectthermalfe: -679.178979 hartree
dipole: 10.3827 0.1489 0.0015
dipole: 10.3838
quadrupole: -83.7079 -76.6984 -82.4991
quadrupole: -4.2999 0.0448 -0.0113
quadrupole: -2.7395 4.2701 -1.5307 -4.2999 0.0448 -0.0113
hfenergy: -679.3174071 hartree
pointgroup: C01 [X(C8H10N4O2)]
dipole: -4.0833838 -0.0018571 -0.1252619 debye
dipolederiv: -0.9018734 -0.0985688 0.1719631 -0.2584095 -0.3443464 0.1904681 0.4849331 0.1954009 -0.6122171 -1.016595 0.087909 -0.1990138 0.220971 -0.3230975 0.1646605 -0.4614657 0.1602612 -0.5742664 -1.8066999 0.1333151 -0.3063728 -0.0464417 -0.2036599 -0.0536878 0.0054932 -0.0478526 -0.1398442 -1.5742193 0.0404863 -0.1233451 0.5356002 -0.177285 0.053311 -1.0839574 0.0384428 -0.2658996 1.9678628 -0.1515969 0.3576313 -0.3512331 -0.0767904 0.0548731 0.7530539 0.0600033 -0.1345402 2.6018504 0.0390665 0.0040325 0.0837249 0.3750619 -0.3622104 -0.0803896 -0.3632021 0.9031294 1.6530155 -0.0035154 0.0572775 0.0100928 0.0639075 -0.031486 0.0307552 -0.0315292 0.110694 -1.3784978 -0.0286437 0.0100071 -0.1147693 0.0279366 0.0146239 0.1766235 0.0169921 0.0086497 -0.5785611 -0.0638161 0.1112895 -0.222654 -0.12173 -0.031879 0.4214723 -0.02665 -0.0680119 -0.7228104 0.0645269 -0.1439855 0.1812262 -0.1127383 -0.0828922 -0.3735728 -0.0870476 0.0000946 0.4454496 0.0455343 -0.0712671 -0.0790098 -0.0785053 -0.045733 0.1743347 -0.0414428 -0.013031 0.5670458 -0.0305264 0.0815936 0.1581212 -0.083716 -0.0376781 -0.2875973 -0.0439857 -0.0289958 0.273113 0.0225876 -0.0403701 0.1231606 0.1796931 0.0313568 -0.2176513 0.0290621 0.1379203 0.328858 -0.0987898 0.1914076 -0.2734753 0.2419384 -0.01036 0.5416802 -0.0053638 0.2657702 0.0654144 0.0326206 -0.067341 0.0228375 0.1257001 0.0582992 -0.0485122 0.0584805 0.0386357 0.0615092 -0.0362789 0.0678285 -0.0291194 0.1176153 0.0727021 0.0540894 0.0725311 0.0148514 0.0779113 -0.029082 0.0542404 -0.0089934 0.1385805 0.0506228 0.0145033 0.0500525 0.0668962 0.079357 0.0299638 -0.0617136 0.0090778 0.1471749 0.0443922 -0.0209472 0.0451956 0.0805065 0.0666309 0.0860713 -0.0038311 -0.0506881 -0.0698338 0.0243655 0.070309 0.0018414 0.0650163 -0.1665086 -0.0066656 -0.0023589 0.0111126 0.1186824 0.0126076 -0.0386637 0.0112742 0.0980329 0.0653507 -0.0443347 -0.0653859 -0.0270074 0.0268042 -0.0760467 0.0912862 -0.0485055 -0.0383293 -0.0983454 0.1205018 -0.0230608 0.2147405 -0.0281169 -0.0239022 -0.0392474 -0.0859928 0.0246429 -0.0921142 -0.0528423 -0.1115386 -0.0932456 -0.0468447 -0.0764156 -0.1953456 -0.0169837 0.0392677 0.0828565 -0.0579226 0.1123135 -0.0156186 0.1035695 0.060008 0.0288161 0.0590179 0.021028 unknown
polarizability: 308.6687021|-1.450176|71.015936|10.8043145|-27.2564355|110.8287661 unknown
InChI: InChI=1S/C8H10N4O2/c1-11(2)10-9-7-3-5-8(6-4-7)12(13)14/h3-6H,1-2H3
charge 0 multiplicity 1
24 atoms
O  4.293973 0.641983 -1.079933
O  4.477374 -0.38639 0.950772
N  -3.951379 0.131144 -0.343132
N  -1.900116 -0.245325 0.454484
N  -2.620181 0.255565 -0.540257
N  3.776113 0.096856 -0.025023
C  -0.497774 -0.116235 0.247125
C  2.308175 0.02252 0.069784
C  0.122429 0.477285 -0.895754
C  0.319401 -0.635718 1.291851
C  1.519487 0.546341 -0.984206
C  1.718963 -0.570118 1.211087
C  -4.514475 -0.500593 0.864204
C  -4.816839 0.668035 -1.398247
H  -0.506765 0.875115 -1.696448
H  -0.175341 -1.086029 2.157798
H  2.019576 0.994684 -1.84696
H  2.361612 -0.963012 2.002951
H  -4.146344 -1.537607 0.961393
H  -5.612468 -0.492001 0.784627
H  -4.192849 0.045065 1.769626
H  -5.469702 1.468847 -1.003582
H  -5.454269 -0.1271 -1.827908
H  -4.172701 1.082187 -2.187953
