program: Gaussian 09
title: 000081616
version: EM64L-G09RevD.01
frameworkgroup: C1[X(C10H13N)]
method: RPBEPBE
basis: SDD
operation: Freq
keyword: #pfreq=noraman
keyword: PBEPBE/SDD
title: #p freq=noraman PBEPBE/SDD
converged: YES YES NO NO
title: Mulliken charges:
elementType: N C C C C C C C C C C H H H H H H H H H H H H H
charge: -0.032016 -0.384188 -0.383034 -0.389101 -0.551084 -0.484514 0.387322 -0.016541 -0.365710 -0.173244 -0.372835 0.185390 0.205022 0.201822 0.209524 0.211226 0.203970 0.205670 0.203939 0.238736 0.195074 0.240220 0.226877 0.237476
chargesum: 0.00000
title: Mulliken charges with hydrogens summed into heavy atoms:
elementType: N C C C C C C C C C C
charge: -0.032016 0.006224 0.028312 0.026094 -0.141475 -0.050704 0.387322 -0.016541 -0.125490 0.053633 -0.135359
polarizability: 1.38330264e+02 7.26739149e-01 1.11495477e+02 -8.50299058e+00 6.45377781e-02 7.08856420e+01
1716.lowfreq: -15.1786 -13.5374 -8.6862 -0.0005 0.0004 0.0006 94.4598 110.9586 206.8485
frequency: 94.4478 110.9404 206.8326 241.3251 308.0752 323.7716 350.6409 411.1937 440.0098 494.4340 512.9935 576.2811 590.1610 687.7777 773.3624 793.7421 797.9506 803.4402 834.1830 866.3672 907.9179 933.4878 952.2004 961.2784 978.5393 1019.9836 1054.8209 1072.8790 1076.0417 1116.8163 1135.8011 1163.7321 1200.6342 1213.7731 1239.9583 1251.1229 1255.6063 1280.2116 1318.5467 1324.8069 1329.9186 1343.4332 1356.4410 1358.5154 1427.6683 1436.1109 1456.1484 1461.9373 1462.9573 1469.8719 1472.6702 1559.2826 1580.7477 2954.4918 2959.2882 2961.5963 2971.7149 2975.2164 3014.7625 3027.3816 3029.5498 3037.8754 3067.4953 3119.5571 3126.9273 3161.0159
redmass: 3.1746 3.2875 2.2945 2.2409 4.2749 2.5746 2.6351 2.1683 2.2547 3.5529 2.1891 4.3440 3.0885 4.4725 2.3036 2.7152 2.3946 1.7072 1.4011 2.4542 1.9853 1.5441 2.2059 2.1063 1.3819 2.3369 2.0684 1.8589 1.9946 2.0609 1.3254 1.2789 1.4397 1.4874 1.7959 1.4413 1.4192 1.2843 3.1204 1.6081 1.4570 1.3969 1.4403 1.4506 1.9287 2.7206 1.1427 1.0905 1.0907 1.1043 1.1017 5.9947 6.2164 1.0617 1.0637 1.0664 1.0628 1.0618 1.0963 1.0969 1.1021 1.1025 1.0935 1.0875 1.0914 1.0996
irintensity: 0.7768 1.1708 0.4118 2.2522 0.6248 1.0651 2.8681 2.4000 0.2596 0.7845 1.9838 1.5896 1.1366 1.0901 22.4681 2.4118 2.1159 33.1235 5.8808 0.3032 4.3925 1.0495 12.0112 4.6794 0.3050 1.6461 1.8090 2.7761 9.4684 0.0498 1.6672 0.2710 2.4900 1.6550 1.2399 1.9928 2.0873 1.4394 2.0239 5.2728 0.5483 0.6634 0.7754 0.6202 2.6971 51.9796 16.0478 9.9236 3.6614 10.3903 21.2513 13.8220 5.7498 33.4814 40.0182 11.1182 31.4345 34.7878 73.5293 59.9731 3.1004 98.1944 17.4329 4.1910 27.8521 34.6336
temp: 298.150 k
press: 1.00000 atm
elementType: 7 6 6 6 6 6 6 6 6 6 6 1 1 1 1 1 1 1 1 1 1 1 1 1
symmnumber: 1
zpe: 543096.6 jmol-1
zpe.correction: 0.206855 hartree
zpe.thermalcorrener: 0.215884 hartree
zpe.thermalcorrenthalpy: 0.216828 hartree
zpe.thermalcorrgfe: 0.172960 hartree
zpe.sumelectzpe: -442.797762 hartree
zpe.sumelectthermal: -442.788733 hartree
zpe.sumelectthermalent: -442.787789 hartree
zpe.sumelectthermalfe: -442.831657 hartree
dipole: -1.0245 2.3020 -0.0165
dipole: 2.5197
quadrupole: -60.6597 -66.7946 -67.6037
quadrupole: 3.9079 -2.0268 0.0351
quadrupole: 4.3597 -1.7753 -2.5844 3.9079 -2.0268 0.0351
hfenergy: -443.0046168 hartree
pointgroup: C01 [X(C10H13N1)]
dipole: -0.4090747 -0.9029853 0.0055633 debye
dipolederiv: -0.435217 0.0641453 -0.022624 -0.0192172 -0.33211 0.0031601 -0.0420655 0.0152798 -0.2432009 0.1019029 -0.0027265 0.0398241 -0.0042675 0.0442395 -0.0002398 0.0496919 -0.0018642 0.1454047 0.1301267 0.0271376 0.0049407 -0.0440005 0.0391995 -0.0096227 -0.0609256 -0.0306659 0.1201932 0.1420903 -0.026072 0.0094722 0.0493468 0.0433153 0.0086987 -0.0670265 0.0439101 0.1195549 -0.0758279 -0.0403893 0.0173824 0.019498 0.1494121 -0.0060685 0.0563009 -0.0069437 0.1020621 -0.1728316 0.0752149 0.0028293 -0.0046373 0.0800987 0.0222219 0.0501516 0.0100482 0.096192 0.063782 0.1584859 0.0168452 0.4140854 -0.1606629 0.0527878 0.0353965 0.0415464 -0.0185407 0.4030682 -0.173404 0.0809292 -0.4203358 0.1986988 -0.0590103 0.1220933 -0.0424644 -0.017334 0.0501126 -0.0634877 0.0526435 -0.0099917 0.1483399 0.0034154 0.046904 -0.0148274 -0.1280266 -0.0766931 -0.048773 0.0297667 -0.2249669 -0.1434853 -0.0445104 0.0063107 -0.0131406 -0.1152774 0.2134878 0.0291286 0.083661 0.2373746 0.2035606 0.0446449 0.0677214 0.0067769 -0.0639625 0.0392931 -0.0002784 -0.0641193 0.0000265 0.0107923 0.0000591 -0.1460496 0.0008061 -0.1612651 -0.149818 0.0034631 0.1276317 0.0020613 0.0353239 -0.0009711 0.173189 -0.0013117 -0.0228921 -0.120114 -0.1413494 0.0130625 -0.1272106 -0.1264647 -0.0085601 0.0097011 -0.0274236 0.072373 0.0279122 0.0524063 -0.0828184 0.0348101 0.0592372 -0.0133728 -0.0474794 0.0257901 -0.1449777 0.0273993 -0.0508769 -0.078566 -0.0323757 0.0638892 0.0190147 -0.0451045 -0.0224206 -0.1440957 -0.114155 0.145282 0.011501 0.1229868 -0.1292702 0.0054705 0.0101873 0.0224422 0.0737338 -0.0107621 -0.0326256 -0.085228 -0.0200929 0.0657986 0.0827928 -0.0679728 0.0161353 -0.1124794 0.0005121 0.103082 0.0217549 0.0207185 -0.1741171 -0.0433864 0.0185808 0.0111328 0.0768491 0.0459795 -0.0873594 0.0275588 -0.0176209 -0.1038629 0.0339204 0.0246819 -0.0078026 0.0840129 -0.0066222 0.0366629 -0.0866777 0.0205336 0.0648054 -0.0880692 -0.0673911 -0.0207869 -0.1206504 0.0959946 -0.0299943 -0.0123475 0.0093869 -0.1183343 -0.0010416 -0.0080967 -0.0054027 0.1315359 -0.0833175 0.0769979 -0.0558296 0.0991343 0.04806 0.0240617 -0.0610152 0.0181709 0.1477935 -0.0963027 -0.0746701 -0.0515927 -0.1052458 0.0335364 -0.025395 -0.0577837 -0.0169844 0.1229975 unknown
polarizability: 138.2805902|-0.904792|111.5062945|8.6558257|0.0068498|70.9244976 unknown
InChI: InChI=1S/C10H13N/c1-2-5-9-6-4-8-11-10(9)7-3-1/h4,6,8H,1-3,5,7H2
charge 0 multiplicity 1
24 atoms
N  1.47359 1.404781 -0.004605
C  -2.882025 0.022384 0.246809
C  -2.10266 -1.30004 0.440875
C  -2.05896 1.318564 0.437032
C  -0.949433 -1.528349 -0.578636
C  -0.902493 1.507752 -0.584251
C  0.319437 -0.744043 -0.282752
C  0.339539 0.685597 -0.283721
C  1.528928 -1.415937 0.01782
C  2.70054 -0.681077 0.307478
C  2.62277 0.72752 0.284469
H  -3.32038 0.028199 -0.774078
H  -3.737448 0.035995 0.951944
H  -2.819191 -2.140134 0.343589
H  -1.69406 -1.349966 1.469926
H  -1.647236 1.359107 1.465092
H  -2.747357 2.181322 0.340166
H  -1.325515 -1.273185 -1.591861
H  -0.698182 -2.606187 -0.599788
H  -0.58423 2.564175 -0.598449
H  -1.284817 1.261872 -1.597907
H  1.549459 -2.512579 0.023833
H  3.644808 -1.182801 0.542231
H  3.501415 1.346832 0.500383
