program: Gaussian 09
title: 000081611
version: EM64L-G09RevD.01
frameworkgroup: C1[X(C8H6I2O2)]
method: RPBEPBE
basis: SDD
operation: Freq
keyword: #pfreq=noraman
keyword: PBEPBE/SDD
title: #p freq=noraman PBEPBE/SDD
converged: NO YES NO NO
title: Mulliken charges:
elementType: I I O O C C C C C C C C H H H H H H
charge: 0.166556 0.120304 -0.376221 -0.311845 0.165761 0.345599 -0.225014 0.231103 -0.532897 -0.391353 -0.105985 -0.782177 0.263280 0.275826 0.248908 0.249383 0.270565 0.388208
chargesum: 0.00000
title: Mulliken charges with hydrogens summed into heavy atoms:
elementType: I I O O C C C C C C C C
charge: 0.166556 0.120304 0.011987 -0.311845 0.165761 0.345599 0.038266 0.231103 -0.532897 -0.391353 0.169841 -0.013321
polarizability: 2.08828238e+02 1.32513631e+00 1.77424958e+02 5.56893387e-03 1.33219652e-02 4.77353606e+01
1716.lowfreq: -2.6050 0.0003 0.0003 0.0003 6.3245 9.8736 64.1882 87.7139 92.6855
frequency: 64.1859 87.7080 92.6802 121.7306 142.0193 155.3839 175.4871 194.0063 253.6105 316.4336 320.6533 370.3428 437.2825 449.0985 526.2886 544.0671 599.9100 619.5285 636.7466 751.7588 768.4310 823.0172 878.4862 905.1899 962.8619 981.4555 1030.2108 1064.1091 1100.4453 1175.4977 1271.1624 1285.9055 1344.3853 1378.2758 1385.1281 1389.4742 1414.9244 1450.9161 1462.2272 1534.9942 1552.2360 1609.8317 2657.6961 2993.5063 3076.9654 3131.6324 3175.8348 3177.9226
redmass: 4.5328 24.6779 9.3286 7.9956 3.8462 1.1864 4.2683 14.3326 6.3082 5.2287 8.7389 5.3214 7.9790 4.3466 4.4528 3.6368 3.1976 5.1978 9.4191 5.9203 7.1411 6.8746 1.4595 1.3714 2.1008 1.0673 1.7286 3.4573 2.3549 2.0697 2.9196 1.9445 2.1865 4.9352 1.4403 4.8726 2.8924 1.1272 1.0473 5.8418 3.4263 3.9049 1.0728 1.0381 1.0968 1.0992 1.0922 1.0926
irintensity: 3.1329 0.0305 0.0410 1.5707 0.4229 0.6146 0.2024 0.3590 2.2164 3.5486 0.0036 6.8806 4.3473 3.9652 6.2245 7.6173 7.1407 23.3099 82.3350 10.2772 13.1909 13.2939 26.2429 3.5658 10.8626 135.4161 2.9794 32.0712 1.0999 68.9685 35.6131 217.6960 277.1394 11.3975 54.3265 26.9099 312.9717 7.5306 22.6049 10.9994 26.7411 109.5481 386.2797 1.4168 6.8556 10.7083 0.3686 0.1315
temp: 298.150 k
press: 1.00000 atm
elementType: 53 53 8 8 6 6 6 6 6 6 6 6 1 1 1 1 1 1
symmnumber: 1
zpe: 310081.9 jmol-1
zpe.correction: 0.118104 hartree
zpe.thermalcorrener: 0.130049 hartree
zpe.thermalcorrenthalpy: 0.130993 hartree
zpe.thermalcorrgfe: 0.076724 hartree
zpe.sumelectzpe: -481.054211 hartree
zpe.sumelectthermal: -481.042267 hartree
zpe.sumelectthermalent: -481.041322 hartree
zpe.sumelectthermalfe: -481.095591 hartree
dipole: 3.2590 0.9980 -0.0027
dipole: 3.4084
quadrupole: -101.5095 -92.0511 -101.2477
quadrupole: 11.5266 0.0107 -0.0198
quadrupole: -3.2401 6.2183 -2.9783 11.5266 0.0107 -0.0198
hfenergy: -481.1723154 hartree
pointgroup: C01 [X(C8H6I2O2)]
dipole: -0.241831 -1.3169549 0.0729415 debye
dipolederiv: -0.0364721 -0.2295227 0.0160016 -0.1788341 -0.378396 0.0310577 0.0135733 0.0350139 0.0463228 -0.1545742 0.2134264 0.0044575 0.2444014 -0.3608769 -0.0032188 0.0034628 -0.0008067 0.0174986 -0.7621191 0.4372319 0.0123252 0.3818305 -0.9042413 -0.0078559 0.0143007 -0.0109409 -0.3657593 -1.1197679 0.0685029 0.0563381 0.474334 -0.6971356 -0.0200686 0.0379257 0.0098917 -0.3343324 -1.2279214 -0.2841537 0.1012162 0.0709337 -0.105903 -0.0022666 0.0864561 0.0242357 -0.0383318 0.4765595 -0.7383861 0.0065567 -0.5433291 0.4175122 0.0319194 -0.0014343 0.045678 0.1666511 0.3195515 0.273271 -0.03932 -0.0992724 -0.3794488 0.0205254 -0.0238316 -0.0075854 -0.0568165 1.9354738 0.2237649 -0.142484 -0.0049045 0.7507149 -0.0248782 -0.1311774 -0.0414856 0.159387 0.0663999 0.8518696 -0.056135 0.5628098 0.7903615 -0.0843049 -0.0444009 -0.1062198 -0.2052532 -0.0130079 -0.7551385 0.0160712 -0.8136587 0.7062776 0.0252013 0.0180444 0.0208444 -0.1986545 -0.0798052 0.0706747 0.0040848 0.2161972 -0.2540243 -0.0051899 -0.0012292 0.0055783 0.0088022 -0.1548719 -0.1566211 0.020094 -0.3143646 -0.3759126 0.0396564 0.0249928 0.0271833 0.0223785 0.0974335 -0.0733412 0.0064959 -0.0592774 0.002402 0.0101328 0.0059891 0.011112 0.1437001 0.0054018 -0.0149111 0.0115292 -0.0069843 0.1245827 0.0015833 0.0112768 0.0021357 0.1495084 0.0705359 0.0246782 -0.0887474 0.0110707 0.0668001 0.0591954 -0.0589377 0.068424 0.0022402 0.091493 0.0195544 0.0731374 0.0052545 0.0562995 -0.0655974 0.0451472 -0.0768107 -0.0075739 -0.0809919 -0.0105777 0.0169487 0.0618712 0.0944028 -0.0034597 0.0142703 0.0024729 0.1268848 0.5666826 0.0796781 -0.01857 -0.0080781 0.4465852 -0.0024317 -0.0144282 -0.0087209 0.3633478 unknown
polarizability: 176.8037533|-2.6833826|208.4654567|-9.629808|-6.3312613|48.7193467 unknown
InChI: InChI=1S/C8H6I2O2/c1-4(11)6-2-5(9)3-7(10)8(6)12/h2-3,12H,1H3
charge 0 multiplicity 1
18 atoms
I  2.269707 3.038267 -0.220732
I  2.65276 -3.095586 0.000133
O  -0.821956 2.225852 0.048406
O  -2.887402 0.817222 0.256712
C  -0.73307 -0.222379 0.141026
C  -0.096321 1.071699 0.040938
C  0.062634 -1.40383 0.12841
C  -2.203939 -0.278921 0.252468
C  1.323563 1.131228 -0.069082
C  1.454643 -1.309974 0.01978
C  2.094269 -0.044009 -0.079518
C  -2.93396 -1.600958 0.361422
H  -0.420751 -2.380871 0.203787
H  3.182006 0.019743 -0.163864
H  -2.603585 -2.165685 1.252444
H  -2.744374 -2.236329 -0.522967
H  -4.013764 -1.406294 0.438653
H  -1.82716 1.953925 0.135082
