program: Gaussian 09
title: 000000130
version: EM64L-G09RevD.01
frameworkgroup: C1[X(C7H8O8)]
method: RPBEPBE
basis: SDD
operation: Freq
keyword: #p
keyword: freq=noraman
keyword: PBEPBE/SDD
title: #p freq=noraman PBEPBE/SDD
converged: NO YES NO NO
title: Mulliken charges:
elementType: O O O O O O O O C C C C C C C H H H H H H H H
charge: -0.470587 -0.409963 -0.229247 -0.404604 -0.136746 -0.228961 -0.374029 -0.213696 0.227912 -0.564145 -0.522714 0.151371 0.148745 0.209354 0.145264 0.272685 0.278434 0.272930 0.295504 0.381264 0.397423 0.384459 0.389347
chargesum: 0.00000
title: Mulliken charges with hydrogens summed into heavy atoms:
elementType: O O O O O O O O C C C C C C C
charge: -0.089324 -0.012540 -0.229247 -0.020144 -0.136746 -0.228961 0.015318 -0.213696 0.227912 -0.013026 0.045719 0.151371 0.148745 0.209354 0.145264
polarizability: 1.04181906e+02 6.63898740e+00 1.06644799e+02 -3.51324895e+00 7.74301687e+00 8.58576917e+01
1716.lowfreq: -9.2992 -0.0009 -0.0006 0.0007 1.1768 4.1058 22.9980 42.1565 44.9747
frequency: 22.8776 42.0831 44.9545 51.5480 70.4470 103.1147 114.9708 126.9364 167.2824 212.5371 224.0929 290.2768 322.0667 325.0364 360.4793 388.4929 400.0706 437.0529 485.0378 516.9762 530.1962 548.9331 574.4354 579.2125 618.1412 638.2724 651.2902 684.5285 724.3105 737.1743 811.6139 869.9622 887.5426 932.5958 991.4457 1009.5494 1032.9260 1069.6611 1075.7028 1092.9285 1158.6352 1209.3551 1248.3596 1268.3033 1283.2636 1299.6532 1328.6170 1372.5900 1385.3261 1419.8572 1439.6993 1628.7664 1634.2440 1646.5018 1661.5047 3027.2553 3029.7465 3096.3565 3108.1502 3468.7487 3508.0771 3511.7529 3529.4468
redmass: 8.4165 7.6653 5.9915 11.2408 7.9905 8.6729 6.3039 8.7844 7.2073 7.7077 4.9595 6.0214 6.2706 2.7131 5.7206 2.7744 1.4160 3.8111 2.3535 2.6436 3.1130 3.0349 2.5036 2.5261 2.5343 1.8208 1.5327 4.4797 4.1372 5.0864 7.6777 4.0663 3.0072 2.4895 3.2982 3.5403 3.4055 2.7782 2.1253 2.0407 2.1843 1.2276 1.2455 1.6363 1.5876 1.8224 2.8687 2.1314 1.7882 1.1200 1.1090 10.4563 10.6320 9.8656 8.5230 1.0594 1.0603 1.0988 1.1052 1.0651 1.0643 1.0640 1.0644
irintensity: 2.9289 4.3508 1.2834 0.2613 3.5843 1.0652 1.2668 2.7737 2.3068 4.3557 0.7706 3.5437 9.4415 46.9624 6.7766 15.4139 88.1640 9.8287 0.9116 78.4089 3.8705 63.7581 93.2013 94.4346 60.0997 54.0682 131.5300 96.3518 23.7899 23.0241 9.9979 3.3089 5.5295 43.5997 30.5956 71.0304 398.0912 224.9581 16.1259 178.7026 47.4435 5.9231 13.7613 6.8811 15.8782 75.0945 14.7651 107.3579 17.1867 28.5043 16.9860 167.1432 138.1873 96.0648 297.4662 2.0617 1.4177 0.2277 1.3388 61.0838 40.3112 32.9200 47.3075
temp: 298.150 k
press: 1.00000 atm
elementType: 8 8 8 8 8 8 8 8 6 6 6 6 6 6 6 1 1 1 1 1 1 1 1
symmnumber: 1
zpe: 406915.5 jmol-1
zpe.correction: 0.154986 hartree
zpe.thermalcorrener: 0.170796 hartree
zpe.thermalcorrenthalpy: 0.171741 hartree
zpe.thermalcorrgfe: 0.109658 hartree
zpe.sumelectzpe: -872.190083 hartree
zpe.sumelectthermal: -872.174273 hartree
zpe.sumelectthermalent: -872.173329 hartree
zpe.sumelectthermalfe: -872.235412 hartree
dipole: -1.4281 -0.3171 0.8938
dipole: 1.7143
quadrupole: -76.0183 -88.3551 -84.3888
quadrupole: -2.7889 -10.2202 -11.8426
quadrupole: 6.9024 -5.4343 -1.4681 -2.7889 -10.2202 -11.8426
hfenergy: -872.3450694 hartree
pointgroup: C01 [X(C7H8O8)]
dipole: 0.5611927 0.175375 0.3304485 debye
dipolederiv: -0.6029393 0.0790607 -0.0798204 0.1258942 -0.3330145 -0.1402027 0.0258319 -0.0485798 -0.6950701 -0.6411089 -0.0646506 -0.3926907 -0.1099485 -0.4531756 -0.262938 -0.3950625 -0.2820225 -0.8476669 -0.4677141 -0.156226 -0.003288 -0.1396914 -0.7010406 0.3091531 -0.1437495 0.134658 -0.8064614 -0.4065844 0.3220793 -0.1442057 0.3106469 -1.2513266 0.1313218 -0.1040589 0.0903571 -0.3661167 -0.5110832 -0.0744555 0.0009186 -0.2510021 -0.4875627 0.2148671 0.0416313 0.2078717 -0.5702391 -0.6554974 -0.112983 0.2412358 0.1489694 -0.8635403 0.1147502 0.1863504 0.2515007 -0.4688356 -0.6162392 -0.4124341 -0.0277685 -0.3884436 -0.8884987 -0.2243653 -0.1357745 -0.3145626 -0.3465321 -0.5379734 0.1062991 -0.1693798 -0.1335588 -0.8183378 -0.0439893 -0.1526098 0.2392079 -0.4491706 0.3829761 -0.224751 0.0315747 -0.3521387 0.186282 0.10422 -0.0075183 0.0714774 0.5627205 -0.5049847 -0.1853117 0.1528447 -0.2090661 -0.1752193 0.0158672 0.0044584 0.0043147 -0.0722691 -0.240899 0.0963238 0.1337506 0.0949028 -0.0765041 0.0622643 0.2283794 -0.0746087 -0.0725104 0.8175158 0.2901601 0.2743975 0.4038389 0.9790127 -0.2188262 0.3782956 0.0089309 1.2267696 0.8620862 0.2895378 0.0502502 0.6212231 0.5468264 -0.3047976 0.1885804 -0.1988754 0.5965161 0.9056911 -0.1771294 -0.3161705 -0.3815388 1.6243232 -0.286157 -0.3431364 -0.3406943 0.5253805 0.7111803 0.233912 0.2128302 0.3534154 1.3508501 0.1989715 0.2765427 -0.0072487 0.4443993 0.0630392 -0.0170001 -0.049488 -0.0466455 0.0863318 0.0097386 -0.040653 -0.0296767 -0.0365266 0.0987657 0.0595941 0.008577 0.0276251 0.0098804 0.0346763 -0.0212783 0.0524522 0.0913809 0.0716599 0.0187305 -0.0208286 0.0190192 0.1044444 -0.0489537 -0.0361983 -0.0167078 0.0038559 0.0637452 -0.0467077 0.0064138 -0.056265 0.0194138 0.0013772 -0.0181329 0.0085411 0.1170206 0.3681256 0.0084318 0.0438616 0.0211374 0.2392346 0.1174614 -0.017849 0.0219864 0.3316321 0.3327104 -0.0752856 0.0242455 -0.0914786 0.2548552 0.0756856 0.0618801 0.13131 0.2929401 0.1847961 -0.0041116 0.1267413 -0.0394957 0.3549751 0.0358384 0.1431466 0.0090309 0.2962848 0.322732 0.0469173 -0.1040013 0.0726005 0.2917903 0.1040372 -0.1190751 0.0813372 0.2424982 unknown
polarizability: 104.275915|7.1887565|103.4802021|2.3956168|-10.6437935|88.9282792 unknown
InChI: InChI=1S/C7H8O8/c8-3(5(11)12)1-7(15,6(13)14)2-4(9)10/h9,11,13,15H,1-2H2
charge 0 multiplicity 1
23 atoms
O  -0.17677 0.01698 -1.349235
O  1.962414 1.87145 0.980666
O  1.358444 2.267707 -1.235652
O  2.534064 -2.575668 0.159042
O  -2.18262 -0.968567 1.702513
O  2.932877 -0.502722 -0.804142
O  -3.601241 -1.178643 -0.68423
O  -3.26525 1.112195 -0.943567
C  0.301153 0.406063 -0.025919
C  -0.912713 0.934314 0.826487
C  0.944538 -0.833987 0.62289
C  1.279962 1.586846 -0.190497
C  -2.032689 -0.095365 0.817083
C  2.216264 -1.242769 -0.093843
C  -3.013182 0.030802 -0.366786
H  -0.587649 1.10875 1.865396
H  -1.278457 1.872112 0.373766
H  1.192815 -0.63394 1.681265
H  0.231798 -1.674614 0.60876
H  0.063001 0.740365 -1.992564
H  2.583629 2.635635 0.841066
H  3.384999 -2.809838 -0.302826
H  -4.231786 -1.060205 -1.446472
