program: Gaussian 09
title: 000081595
version: EM64L-G09RevD.01
frameworkgroup: C1[X(C9H8N2)]
method: RPBEPBE
basis: SDD
operation: Freq
keyword: #p
keyword: freq=noraman
keyword: PBEPBE/SDD
title: #p freq=noraman PBEPBE/SDD
converged: NO NO NO NO
title: Mulliken charges:
elementType: N N C C C C C C C C C H H H H H H H H
charge: -0.224529 -0.084539 0.477884 -0.345530 -0.330248 -0.162595 -0.203421 -0.225857 -0.224366 -0.245868 -0.337746 0.228415 0.227562 0.249147 0.250552 0.231173 0.231497 0.235104 0.253366
chargesum: 0.00000
title: Mulliken charges with hydrogens summed into heavy atoms:
elementType: N N C C C C C C C C C
charge: -0.224529 -0.084539 0.477884 -0.117115 -0.102686 0.086551 0.047131 0.005316 0.007131 -0.010764 -0.084380
polarizability: 1.64614209e+02 -9.03464632e-01 1.08797219e+02 1.03683247e-03 8.95057688e-04 4.27106208e+01
1716.lowfreq: -62.1723 -8.5705 -6.8735 0.0005 0.0007 0.0009 25.1072 109.2760 192.2225
frequency: -62.0525 109.1898 192.2167 259.7247 361.8093 398.9741 431.9729 507.7098 613.8102 615.6826 643.5178 675.8831 687.8927 708.3750 766.3652 767.1258 827.6414 848.2284 876.3868 906.3516 949.6075 967.7622 986.4714 991.7063 1025.2245 1031.5843 1085.7216 1096.3843 1112.6176 1176.6562 1201.0071 1234.6637 1248.0830 1290.0025 1338.1018 1356.1878 1380.6762 1436.0889 1449.8763 1477.2047 1500.4363 1596.0523 1614.8868 3132.4102 3140.7854 3154.8123 3162.8044 3173.5047 3230.5974 3253.4473 3264.4381
redmass: 3.3652 5.1248 4.5206 4.3174 7.0448 2.7894 4.4699 3.0501 6.4456 2.4256 2.7359 6.3404 2.0061 1.4025 1.4378 1.9493 1.2732 1.4149 6.3371 1.4478 6.2366 1.3827 5.8905 1.3194 2.7047 1.7717 1.5567 2.6155 1.8358 1.0576 1.1583 3.5441 1.3072 2.2971 1.3577 5.3369 8.0965 2.8758 2.5970 4.0147 2.6119 6.3868 6.0657 1.0850 1.0886 1.0923 1.0958 1.1012 1.0923 1.0963 1.1081
irintensity: 1.0649 0.2408 1.4225 0.6208 0.8000 0.0006 0.6804 14.4097 0.0471 0.0607 7.8118 8.7234 18.5880 40.4666 171.2870 2.1436 0.0189 4.5797 6.5361 8.2038 13.9441 0.0002 0.0184 0.4314 0.9202 69.8431 2.4127 3.1408 29.3161 0.3295 0.9037 8.5916 37.3527 112.0471 0.8734 0.1126 0.6370 50.3688 16.5429 0.1054 151.9307 6.5769 62.4952 2.3056 4.9443 27.2493 23.3258 5.2604 3.6789 1.1023 1.6766
temp: 298.150 k
press: 1.00000 atm
elementType: 7 7 6 6 6 6 6 6 6 6 6 1 1 1 1 1 1 1 1
symmnumber: 1
zpe: 390333.5 jmol-1
zpe.correction: 0.148670 hartree
zpe.thermalcorrener: 0.156075 hartree
zpe.thermalcorrenthalpy: 0.157019 hartree
zpe.thermalcorrgfe: 0.116271 hartree
zpe.sumelectzpe: -456.481212 hartree
zpe.sumelectthermal: -456.473807 hartree
zpe.sumelectthermalent: -456.472863 hartree
zpe.sumelectthermalfe: -456.513611 hartree
dipole: 3.8095 1.3726 -0.0004
dipole: 4.0492
quadrupole: -69.3107 -54.5388 -69.8725
quadrupole: -6.8454 0.0007 0.0011
quadrupole: -4.7367 10.0352 -5.2985 -6.8454 0.0007 0.0011
hfenergy: -456.6298817 hartree
pointgroup: C01 [X(C9H8N2)]
dipole: -1.5040681 0.5250328 -0.0001397 debye
dipolederiv: -1.4433093 0.0277053 -0.0000775 0.0871203 -0.0903956 -0.0000028 0.000086 0.0000373 0.016032 -0.8224046 0.0261869 -0.0000378 -0.2830762 -0.2370553 0.000009 0.0002114 -0.0000086 -0.2608517 1.3758454 0.0064433 0.0002354 0.0084738 0.0621784 0.0000716 0.0002255 0.0000235 0.0904901 -0.2763996 0.0252189 0.0000544 0.2366537 -0.008784 0.0001183 -0.0000579 0.0000969 -0.1720948 -0.2827618 -0.0255451 0.0000043 -0.2280906 -0.0083507 -0.0000583 0.0000456 -0.000062 -0.1585269 0.4016093 0.0588356 -0.0000863 0.3856017 -0.0920481 -0.0000464 -0.0002732 0.0000537 -0.1837377 0.8132418 -0.1612362 -0.0000494 -0.4459045 0.0775389 -0.0002059 -0.0001273 -0.0001511 -0.113432 0.0702344 -0.0301424 0.000049 -0.1057604 0.1330704 0.0000036 0.0000223 0.000012 -0.1443924 0.087121 0.0305566 0.0000479 0.0869308 0.1353794 0.0000298 0.0000664 0.0000389 -0.1430487 -0.0085457 0.0008974 0.0000882 0.0138874 -0.1391613 -0.0000029 0.0000914 -0.0000087 -0.172625 -0.1300363 0.1199542 -0.0000651 0.3351373 0.1491845 -0.0001151 -0.0002536 -0.0001892 -0.1824219 0.0518496 -0.0996064 -0.0000682 -0.0998924 -0.026962 -0.000075 -0.0000706 -0.0000819 0.1639193 0.0469042 0.1017298 -0.0000452 0.0942939 -0.0182859 0.0000253 -0.000005 0.000061 0.1620009 0.0995155 0.0935908 -0.0000288 0.0467014 0.0216655 0.0001031 0.0000283 0.0000398 0.2222014 0.0812257 -0.0800779 0.0000913 -0.0679198 0.0278764 0.0001177 0.0000926 0.0000994 0.1950709 0.0264867 0.0777731 -0.0000285 0.1007314 -0.0619663 -0.0000005 -0.0000191 -0.0000001 0.15808 0.0316671 -0.0754058 -0.0000386 -0.0977443 -0.0647584 -0.0000296 -0.0000453 -0.0000266 0.1575457 -0.1207465 -0.0026322 -0.0000963 -0.0027866 0.0931974 -0.0000078 -0.000108 0.0000004 0.1701192 -0.001497 -0.0942458 0.000051 -0.0643568 0.0476769 0.0000661 0.0000906 0.0000654 0.1956715 unknown
polarizability: 164.590621|1.4601912|108.8208019|0.0192432|-0.0118376|42.7106261 unknown
InChI: InChI=1S/C9H8N2/c1-2-4-9(5-3-1)11-7-6-10-8-11/h1-8H
charge 0 multiplicity 1
19 atoms
N  1.017578 0.022446 0.000193
N  3.170309 -0.729158 0.000201
C  -0.416978 0.007195 -0.000216
C  -1.149758 1.221714 -0.000299
C  -1.122426 -1.223782 -0.000402
C  1.849289 1.159749 -0.000627
C  1.876599 -1.092016 0.000681
C  -2.56088 1.202039 -0.000719
C  -2.533101 -1.234654 -0.000811
C  -3.26451 -0.024234 -0.001032
C  3.156863 0.677093 -0.000286
H  -0.635615 2.187634 0.000111
H  -0.587537 -2.178582 -0.00016
H  1.471725 2.177144 -0.001129
H  1.529199 -2.120127 0.001456
H  -3.108479 2.150834 -0.000766
H  -3.059197 -2.195502 -0.000979
H  -4.359534 -0.036698 -0.001415
H  4.079553 1.252205 -0.000602
