program: Gaussian 09
title: 000000127
version: EM64L-G09RevD.01
frameworkgroup: C1[X(C8H8O3)]
method: RPBEPBE
basis: SDD
operation: Freq
keyword: #p
keyword: freq=noraman
keyword: PBEPBE/SDD
title: #p freq=noraman PBEPBE/SDD
converged: YES YES NO NO
title: Mulliken charges:
elementType: O O O C C C C C C C C H H H H H H H H
charge: -0.433173 -0.407461 -0.236868 0.444083 -0.616306 -0.327970 -0.383063 -0.378783 -0.338270 0.281854 0.214402 0.240785 0.244891 0.256532 0.236182 0.220442 0.252276 0.354053 0.376394
chargesum: 0.00000
title: Mulliken charges with hydrogens summed into heavy atoms:
elementType: O O O C C C C C C C C
charge: -0.079120 -0.031067 -0.236868 0.444083 -0.130630 -0.071438 -0.146881 -0.158341 -0.085994 0.281854 0.214402
polarizability: 1.25798190e+02 -2.93056979e+00 9.83199125e+01 7.97657903e+00 1.11386502e+00 5.51245719e+01
1716.lowfreq: -6.8085 -0.0004 -0.0003 0.0008 5.5327 9.2657 18.6378 33.0999 79.3886
frequency: 16.5550 33.0660 79.3871 162.3881 262.7980 332.8579 355.3947 388.1944 403.3247 410.9391 440.9893 507.5657 536.5027 613.6853 635.3664 684.0307 709.0293 775.7088 806.8528 821.0956 835.1967 863.6193 925.5791 942.8440 959.2770 1005.1826 1055.2184 1105.7899 1143.8875 1178.1057 1183.4812 1202.7560 1248.6507 1272.2114 1309.5276 1332.8700 1394.8220 1428.7719 1453.2745 1504.0816 1599.9407 1626.5172 1661.4952 3021.2348 3103.1863 3115.2225 3134.0040 3148.6950 3172.7834 3504.9371 3582.7442
redmass: 4.6976 6.9884 7.2392 6.1783 4.6801 5.4482 1.1376 3.2486 2.8338 2.9327 4.1229 2.7346 3.5801 1.7463 6.5476 2.4582 3.6165 4.1544 1.6708 1.6999 3.9528 3.2652 1.8808 1.4558 1.3676 2.8510 1.9107 1.4351 1.3452 1.1783 1.1607 2.3908 2.9004 1.4587 1.6565 1.5699 6.1275 2.7952 1.1017 2.6480 6.5450 6.3341 8.4965 1.0618 1.1005 1.0889 1.0899 1.0956 1.0956 1.0638 1.0660
irintensity: 2.0120 2.7871 1.3119 0.1003 1.7293 1.8431 146.8905 4.3685 12.6955 0.1737 1.4398 9.2022 76.9030 118.2837 2.1632 64.3149 1.7566 23.5014 43.6729 14.1475 21.8986 10.6951 24.9906 8.3630 2.4556 5.5408 192.0098 111.7270 186.3308 23.9248 2.2683 3.4571 27.9901 2.6986 46.6818 24.4785 18.8641 21.2104 20.1859 95.9198 6.8497 35.0253 217.0466 14.4226 5.2840 17.1961 11.8553 5.4500 5.7937 20.8081 39.0787
temp: 298.150 k
press: 1.00000 atm
elementType: 8 8 8 6 6 6 6 6 6 6 6 1 1 1 1 1 1 1 1
symmnumber: 1
zpe: 376773.7 jmol-1
zpe.correction: 0.143506 hartree
zpe.thermalcorrener: 0.153603 hartree
zpe.thermalcorrenthalpy: 0.154547 hartree
zpe.thermalcorrgfe: 0.105722 hartree
zpe.sumelectzpe: -534.523820 hartree
zpe.sumelectthermal: -534.513723 hartree
zpe.sumelectthermalent: -534.512779 hartree
zpe.sumelectthermalfe: -534.561604 hartree
dipole: -0.1907 0.1844 0.1579
dipole: 0.3087
quadrupole: -60.3857 -61.4725 -62.6219
quadrupole: -11.7327 -0.9223 -0.5347
quadrupole: 1.1077 0.0208 -1.1285 -11.7327 -0.9223 -0.5347
hfenergy: -534.6673259 hartree
pointgroup: C01 [X(C8H8O3)]
dipole: -0.081628 -0.0795849 -0.0419289 debye
dipolederiv: -1.4599855 -0.0092861 0.2842424 0.0023853 -0.0747693 -0.0656326 0.3226302 -0.0621157 -0.5071137 -0.7149608 -0.3783191 -0.0696382 -0.4271358 -0.8169975 -0.2476367 -0.2393316 -0.3295316 -0.4082339 -0.5621898 0.1304075 -0.1482689 0.0314178 -0.8983127 0.0219885 -0.2647331 0.2363106 -0.4882926 0.2767036 -0.0369311 -0.0060213 0.0212101 -0.1753928 0.0445815 -0.1700366 0.0565427 -0.1270314 -0.2585005 0.0612951 -0.1765625 0.1069594 0.0630347 0.0211239 -0.125894 0.0271231 -0.0006676 0.0363887 0.0633424 -0.069277 -0.0543591 0.0808335 -0.0256329 -0.0321805 -0.0817294 -0.0958312 0.0495069 -0.0594709 -0.0763324 -0.0174173 0.1315271 -0.0565288 -0.0757239 -0.0194798 -0.1110473 -0.3363656 -0.0220487 0.0299086 0.2861814 0.006986 -0.1109216 -0.0052192 -0.0309702 -0.188171 -0.2877471 0.004476 0.0207366 -0.2676407 0.0265807 0.0470071 0.0928144 -0.0372582 -0.1785764 1.3510822 0.0181614 -0.3719251 0.0068045 0.0636461 -0.0009757 -0.4047387 -0.0031427 0.1959636 0.9294365 0.1779636 0.4968507 0.2509593 1.3954252 0.085532 0.8428451 -0.0331001 0.6768485 0.0570311 -0.009058 0.0096464 -0.0667716 -0.0416395 0.0895215 -0.0014382 0.0449219 0.0649811 0.0223153 0.0116512 0.0247607 0.0591008 0.0055411 -0.107 0.0404062 -0.050109 0.0105785 0.0693339 0.0847242 0.0240143 0.0795534 -0.0046791 0.0046285 0.0115462 0.0122838 0.134579 0.0472113 -0.0910279 0.055183 -0.074673 -0.0301779 0.051214 0.0410317 0.0575244 0.119476 -0.0069507 -0.0912263 0.0663835 -0.0842264 -0.0325287 0.0599751 0.0748472 0.0641694 0.1401705 0.0453089 0.0788812 0.021966 0.0812582 -0.0129214 0.0088533 0.0307845 0.0086226 0.165248 0.406852 0.0241311 -0.0049868 -0.0143533 0.0596684 0.0664251 -0.0036244 0.0528507 0.3752135 0.3355294 0.0423344 -0.11068 0.080747 0.2541762 0.1134779 -0.1339851 0.0870874 0.2219064 unknown
polarizability: 125.3357751|-1.1517701|96.5466009|-10.6289624|-8.0158723|57.3602986 unknown
InChI: InChI=1S/C8H8O3/c9-7-3-1-6(2-4-7)5-8(10)11/h1-4,9-10H,5H2
charge 0 multiplicity 1
19 atoms
O  -3.760397 0.163077 0.623748
O  3.324806 0.72799 0.549978
O  2.852672 -1.546186 0.530401
C  0.285441 -0.01382 -0.640248
C  1.74353 -0.05015 -1.10389
C  -0.36767 -1.198391 -0.217656
C  -0.437438 1.205446 -0.619409
C  -1.71213 -1.169885 0.208534
C  -1.781847 1.249661 -0.197314
C  -2.41857 0.057861 0.215958
C  2.673431 -0.407056 0.046375
H  2.040604 0.924954 -1.519465
H  1.877732 -0.823647 -1.881436
H  0.182284 -2.146173 -0.210098
H  0.054665 2.132843 -0.93472
H  -2.204665 -2.096282 0.532216
H  -2.345945 2.186637 -0.181225
H  -4.114733 -0.718446 0.89954
H  3.88953 0.464968 1.32751
