program: Gaussian 09
title: 000081579
version: EM64L-G09RevD.01
frameworkgroup: C1[X(C9H10O3)]
method: RPBEPBE
basis: SDD
operation: Freq
keyword: #pfreq=noraman
keyword: PBEPBE/SDD
title: #p freq=noraman PBEPBE/SDD
converged: YES YES NO NO
title: Mulliken charges:
elementType: O O O C C C C C C C C C H H H H H H H H H H
charge: -0.270807 -0.439852 -0.261571 0.347518 0.218494 0.270523 -0.500634 -0.373589 -0.351466 -0.782508 0.104341 -0.535546 0.281735 0.237460 0.272895 0.243228 0.243077 0.216311 0.226933 0.226885 0.244572 0.382000
chargesum: 0.00000
title: Mulliken charges with hydrogens summed into heavy atoms:
elementType: O O O C C C C C C C C C
charge: -0.270807 -0.057851 -0.261571 0.347518 0.218494 0.270523 -0.218899 -0.136128 -0.078571 -0.079892 0.104341 0.162844
polarizability: 1.54325826e+02 -3.02795887e+00 1.25355525e+02 9.07656809e-03 -1.96116630e-02 5.30517143e+01
1716.lowfreq: -11.1217 -4.3488 0.0005 0.0008 0.0008 5.0470 61.9469 96.0661 111.8404
frequency: 61.9466 96.0646 111.8380 133.7740 144.2489 183.6978 224.4687 251.5402 304.8405 306.3430 336.1678 446.0082 450.4223 499.6620 533.8791 543.3543 580.3193 611.7554 687.5852 715.8449 737.8118 751.5663 843.3735 871.3425 901.9380 969.5133 985.6521 998.1133 1043.8731 1046.1774 1114.2065 1123.1899 1146.3932 1157.9543 1194.9808 1234.5581 1277.7330 1323.6666 1388.6257 1397.9945 1411.2691 1445.0600 1455.0145 1467.1784 1471.2416 1472.5124 1500.6008 1581.8539 1612.5400 1638.6802 2965.4091 2984.1448 3055.4096 3061.4806 3095.7895 3127.8022 3136.4299 3167.5879 3183.1247 3530.8451
redmass: 8.0335 2.9084 3.1628 1.1690 5.0355 2.0694 3.3461 1.5199 3.4282 3.4387 7.2228 2.9492 5.4825 5.2398 2.2292 4.5374 4.7826 1.6091 5.5152 4.6794 2.9643 4.4544 1.3459 6.1725 1.5570 1.3558 2.9509 2.1652 2.7814 1.5553 1.2628 1.8951 1.4138 1.4821 2.4417 2.3893 1.5753 2.5856 3.1773 1.4073 3.1972 1.3065 1.0456 1.0489 1.0936 1.1599 2.9073 7.0775 6.5071 8.4018 1.0326 1.0366 1.1041 1.0963 1.1004 1.1001 1.0901 1.0909 1.0950 1.0641
irintensity: 2.5858 0.2661 6.0292 2.3291 3.2900 0.7154 3.5228 0.0400 1.0942 0.0043 4.2530 8.5142 0.3539 1.4800 50.8277 2.7557 56.1650 84.2554 16.9812 21.3527 40.9658 10.0154 17.0035 40.4909 29.0888 1.0765 55.5932 109.3640 150.5062 9.0026 0.1538 67.8973 31.2354 15.0806 63.2264 67.7774 38.2015 135.1661 22.7971 61.0796 57.0078 15.0716 12.9180 14.0567 38.3238 23.7132 12.7945 59.5323 58.6985 261.8396 53.7686 20.9776 40.9539 15.8800 20.1431 22.5110 16.7173 3.3667 1.8019 45.6870
temp: 298.150 k
press: 1.00000 atm
elementType: 8 8 8 6 6 6 6 6 6 6 6 6 1 1 1 1 1 1 1 1 1 1
symmnumber: 1
zpe: 449176.2 jmol-1
zpe.correction: 0.171082 hartree
zpe.thermalcorrener: 0.182759 hartree
zpe.thermalcorrenthalpy: 0.183703 hartree
zpe.thermalcorrgfe: 0.133408 hartree
zpe.sumelectzpe: -573.748030 hartree
zpe.sumelectthermal: -573.736353 hartree
zpe.sumelectthermalent: -573.735409 hartree
zpe.sumelectthermalfe: -573.785704 hartree
dipole: 1.3406 -0.3386 0.0069
dipole: 1.3827
quadrupole: -63.6201 -64.0889 -72.4361
quadrupole: 6.3270 -0.0088 0.0147
quadrupole: 3.0950 2.6261 -5.7211 6.3270 -0.0088 0.0147
hfenergy: -573.9191118 hartree
pointgroup: C01 [X(C9H10O3)]
dipole: 0.5190422 0.160355 0.0287661 debye
dipolederiv: -0.8924783 0.6457182 0.0961261 0.6159934 -1.0219728 -0.1099264 0.0911723 -0.1094125 -0.3058831 -1.198499 0.3938984 0.0523159 0.5570851 -0.5292452 -0.0092464 0.0776854 -0.0113293 -0.4255491 -0.8213512 -0.2496085 -0.0452178 -0.2790605 -1.0226117 -0.111212 -0.0502651 -0.11141 -0.3529899 0.3690733 0.1945841 0.0352717 0.3532034 -0.0658498 -0.0018389 0.0596544 -0.0041336 -0.0305473 0.7543221 -0.8995217 -0.1358071 -0.8086045 0.3610249 0.0372252 -0.1210541 0.0360678 0.0744343 -0.697808 -0.3553497 -0.0646817 -0.3026378 -0.0419559 -0.0105525 -0.0565215 -0.0110991 0.0014374 -0.0790089 0.3980585 0.0644291 -0.1675393 -0.0886965 0.0109152 -0.0252586 0.0174118 -0.1677728 -0.212945 -0.0447996 -0.0076516 0.0529095 0.1530017 0.0514561 0.0080701 0.0504124 -0.1588595 0.0512812 -0.0042111 0.0016021 0.1698465 -0.0600805 0.0140573 0.0292627 0.0117775 -0.1339408 -0.2542444 -0.0866223 -0.0171203 0.0126104 0.1285289 0.0129646 0.0006889 0.0127398 0.0530727 2.137095 0.1693277 0.0504643 0.1317566 1.3495503 0.1778732 0.045081 0.1789863 0.2526523 0.2080978 0.0038133 -0.0006257 -0.2883817 0.7659813 0.0684672 -0.0473846 0.0718833 0.3275117 0.1435108 -0.0224062 -0.0038276 0.0219825 -0.011117 -0.0276167 0.0032388 -0.0280637 0.1598166 0.0696692 -0.0476848 -0.0085559 -0.0405866 -0.1078608 -0.0414221 -0.0074524 -0.0415423 0.142654 0.0321275 0.0667037 0.009019 0.0694039 0.0640578 -0.0157383 0.0093603 -0.0156909 0.1656238 0.0083462 -0.0023193 -0.0740364 0.0088165 0.0531531 0.0886772 -0.114159 0.0435057 -0.0105153 0.0041683 -0.0258787 0.0703039 -0.0271617 0.086757 -0.0564538 0.1115706 -0.0117985 -0.0413806 0.0714171 0.0536254 0.0084335 -0.0593713 -0.1568017 -0.0441272 -0.0104102 -0.0428557 0.1003744 0.0615703 -0.0955849 -0.1286706 0.049681 -0.0258687 -0.0179576 -0.0619536 -0.0673558 -0.0995442 0.0573665 -0.1331247 0.0953361 0.026697 -0.0581549 0.0319517 0.0774615 0.0776691 -0.0632438 -0.1041197 0.1220684 0.0169643 0.0706854 0.0341399 -0.013312 0.008759 -0.0127016 0.1204057 0.2924093 -0.0806862 -0.0140714 -0.1673276 0.1940207 -0.0341841 -0.027546 -0.0330609 0.3922436 unknown
polarizability: 153.8775032|4.410071|123.9840403|1.8553475|11.3202548|54.8715215 unknown
InChI: InChI=1S/C9H10O3/c1-6-3-4-7(9(10)11)5-8(6)12-2/h3-5,10H,1-2H3
charge 0 multiplicity 1
22 atoms
O  2.563798 -0.913289 -0.281477
O  -3.430782 0.449118 -0.136485
O  -2.617385 -1.699851 -0.463904
C  1.581291 1.237459 0.04998
C  1.383283 -0.161333 -0.175111
C  -1.042048 0.143056 -0.154448
C  0.088633 -0.7074 -0.276584
C  0.435208 2.05603 0.167272
C  -0.871212 1.529525 0.068201
C  2.982921 1.794278 0.154254
C  -2.38368 -0.480014 -0.269153
C  2.429445 -2.355016 -0.513908
H  -0.087452 -1.773261 -0.447728
H  0.574908 3.129275 0.339788
H  -1.748946 2.173767 0.1602
H  3.542381 1.306868 0.973837
H  3.557758 1.594253 -0.768791
H  2.966661 2.882342 0.333276
H  1.907616 -2.559897 -1.468399
H  1.887388 -2.846277 0.31691
H  3.460176 -2.735151 -0.563055
H  -4.293864 -0.03718 -0.224177
