program: Gaussian 09
title: 000081606
version: EM64L-G09RevD.01
frameworkgroup: C1[X(C14H18O2)]
method: RPBEPBE
basis: SDD
operation: Freq
keyword: #pfreq=noraman
keyword: PBEPBE/SDD
title: #p freq=noraman PBEPBE/SDD
converged: YES YES NO NO
title: Mulliken charges:
elementType: O O C C C C C C C C C C C C C C H H H H H H H H H H H H H H H H H H
charge: -0.443294 -0.437470 0.170819 0.142417 -0.475354 -0.508099 -0.478220 -0.500434 -0.450010 -0.412550 -0.453333 -0.415588 0.092566 0.086153 -0.112186 -0.105260 0.211230 0.252804 0.215328 0.235739 0.243777 0.228079 0.241768 0.221432 0.218586 0.237059 0.218146 0.215300 0.232440 0.216457 0.215139 0.226504 0.332893 0.337161
chargesum: 0.00000
title: Mulliken charges with hydrogens summed into heavy atoms:
elementType: O O C C C C C C C C C C C C C C
charge: -0.110401 -0.100309 0.170819 0.142417 -0.011320 -0.057032 -0.006364 -0.037234 0.005635 0.020896 -0.004435 0.026056 0.092566 0.086153 -0.112186 -0.105260
polarizability: 2.80530738e+02 -7.11186233e+00 1.26373740e+02 -3.02265903e+00 -2.09290272e+00 1.18270237e+02
1716.lowfreq: -12.5190 -0.0008 -0.0004 0.0005 4.5353 5.6133 20.5991 29.9856 36.5566
frequency: 10.4282 29.9709 36.2913 49.9809 53.7210 78.1531 98.8299 152.5202 195.1926 213.7070 222.8698 238.0055 284.9973 292.7083 322.4600 355.0425 377.0292 416.7799 429.6729 453.7889 482.5593 522.4200 526.9218 540.2513 580.3204 595.4007 614.3497 662.9620 736.7488 767.9093 779.7694 812.3299 833.6688 848.0188 867.5649 892.7060 901.1057 943.0511 948.5329 957.3311 963.5659 982.1367 1009.7421 1032.9215 1035.6475 1063.7300 1069.1216 1075.7359 1087.0252 1164.7765 1173.4466 1179.8859 1186.9854 1188.3150 1211.4470 1224.4049 1242.2333 1252.5868 1262.5964 1272.8996 1279.9981 1296.5102 1302.8990 1308.6607 1310.5592 1320.1587 1332.5128 1357.9307 1448.7674 1457.1937 1461.3317 1469.7189 1470.7287 1473.7816 1485.5127 1490.1325 2158.5857 2281.0573 2999.9670 3002.7260 3008.4759 3012.1926 3013.3834 3014.6932 3021.6778 3021.8419 3054.6896 3055.9108 3072.8758 3073.9518 3085.2532 3085.7541 3096.4435 3100.5973 3544.7905 3551.3340
redmass: 3.7244 3.4692 3.4776 2.3988 2.3845 3.2888 3.2791 3.9060 2.6363 5.1215 3.8548 2.6833 1.1120 1.1498 4.5039 3.7602 2.5998 3.7935 5.4111 4.8599 6.2910 5.0383 7.4124 6.8082 3.0631 3.7620 2.6035 3.5458 3.3371 1.4581 1.2820 1.6796 1.8658 3.0065 3.0652 2.6691 2.6000 2.0751 1.9675 2.1144 1.8270 3.0945 1.9620 1.5729 1.7087 2.1076 2.5636 2.5319 2.8508 1.5284 1.5057 1.3081 1.3990 1.3808 1.6111 1.2473 1.2905 1.3725 1.3364 1.4179 1.3334 1.2960 1.3429 1.4687 1.4572 1.4179 1.6364 2.7395 1.0882 1.0824 1.0801 1.0842 1.0861 1.0807 1.0947 1.0949 11.9742 11.9855 1.0595 1.0585 1.0612 1.0613 1.0618 1.0608 1.0660 1.0661 1.1023 1.1011 1.1033 1.1042 1.1038 1.1032 1.1041 1.1041 1.0662 1.0662
irintensity: 1.0170 0.3332 0.4351 0.1055 0.5215 0.0312 0.2090 0.0720 0.7733 0.9057 2.5197 1.7658 283.2929 45.8289 20.5109 5.9119 18.4018 7.2406 14.9910 3.8465 11.8580 8.3850 3.2639 1.3093 1.6502 2.5457 10.8056 2.3891 8.5020 6.3101 5.4967 0.1859 28.8188 11.6242 12.2122 4.0751 10.6984 6.6811 48.8912 8.0002 24.3046 110.5265 5.8292 0.6200 8.7352 7.0798 7.8474 20.1347 9.2809 1.8080 21.2441 8.7232 1.0703 1.1685 59.9903 25.8270 5.5710 41.1601 13.8548 4.0372 27.9984 11.3639 8.9956 29.5380 23.5910 0.0917 52.4585 15.1199 12.3558 2.4081 8.4871 11.6781 8.3712 8.8489 4.3214 7.5685 2.3744 2.3215 29.7449 7.3295 53.1677 51.2203 33.6103 33.5128 41.0194 17.8173 11.8233 7.5741 8.1954 14.2061 45.7387 41.4522 58.6736 40.9037 9.2181 10.5702
temp: 298.150 k
press: 1.00000 atm
elementType: 8 8 6 6 6 6 6 6 6 6 6 6 6 6 6 6 1 1 1 1 1 1 1 1 1 1 1 1 1 1 1 1 1 1
symmnumber: 1
zpe: 743645.8 jmol-1
zpe.correction: 0.283240 hartree
zpe.thermalcorrener: 0.300316 hartree
zpe.thermalcorrenthalpy: 0.301261 hartree
zpe.thermalcorrgfe: 0.235171 hartree
zpe.sumelectzpe: -693.403529 hartree
zpe.sumelectthermal: -693.386452 hartree
zpe.sumelectthermalent: -693.385508 hartree
zpe.sumelectthermalfe: -693.451597 hartree
dipole: -0.4219 -0.1863 0.3031
dipole: 0.5519
quadrupole: -90.0517 -93.9641 -94.7672
quadrupole: 9.4828 8.6774 -7.3520
quadrupole: 2.8759 -1.0364 -1.8395 9.4828 8.6774 -7.3520
hfenergy: -693.6867685 hartree
pointgroup: C01 [X(C14H18O2)]
dipole: 0.1675944 -0.1149273 -0.0764409 debye
polarizability: 280.5616758|6.2581477|126.6404058|-3.8706691|-1.6393753|117.9726327 unknown
InChI: InChI=1S/C14H18O2/c15-13(7-1-2-8-13)11-5-6-12-14(16)9-3-4-10-14/h15-16H,1-4,7-10H2
charge 0 multiplicity 1
34 atoms
O  3.613511 -0.611735 -1.554171
O  -3.966766 -1.740266 1.053789
C  3.195156 -0.061617 -0.228119
C  -3.567271 -0.500519 0.34378
C  3.74458 1.390311 -0.229216
C  3.987964 -0.767556 0.928168
C  -4.182877 0.695677 1.117474
C  -4.2401 -0.373102 -1.065319
C  5.250949 1.188019 0.05026
C  5.285603 0.07939 1.142296
C  -4.199532 1.845767 0.083528
C  -4.44332 1.155442 -1.303891
C  1.736178 -0.155894 -0.082869
C  -2.098172 -0.410757 0.246877
C  0.501344 -0.247439 0.022005
C  -0.8618 -0.336037 0.139886
H  3.262013 1.961305 0.585386
H  3.524055 1.885115 -1.188927
H  4.207813 -1.810843 0.638153
H  3.374212 -0.804182 1.845506
H  -3.625138 0.932746 2.037836
H  -5.20771 0.390724 1.401134
H  -5.212145 -0.895169 -0.990746
H  -3.648997 -0.856344 -1.862252
H  5.749959 2.119081 0.3724
H  5.743813 0.832096 -0.871117
H  6.199738 -0.535273 1.074085
H  5.271096 0.537311 2.14859
H  -3.223564 2.364048 0.082592
H  -4.971316 2.598614 0.320231
H  -5.463059 1.355436 -1.678081
H  -3.738925 1.543914 -2.059777
H  3.25179 -1.532203 -1.634681
H  -3.481681 -2.505362 0.649889
