program: Gaussian 09
title: 000081570
version: EM64L-G09RevD.01
frameworkgroup: C1[X(C9H15N)]
method: RPBEPBE
basis: SDD
operation: Freq
keyword: #pfreq=noraman
keyword: PBEPBE/SDD
title: #p freq=noraman PBEPBE/SDD
converged: YES YES NO NO
title: Mulliken charges:
elementType: N C C C C C C C C C H H H H H H H H H H H H H H H
charge: -0.164475 -0.368801 -0.368639 -0.450659 -0.454966 0.372946 -0.510202 -0.443900 -0.435965 -0.412243 0.202887 0.226723 0.213480 0.220466 0.222945 0.221282 0.226416 0.218579 0.215761 0.217111 0.208463 0.215546 0.199993 0.201433 0.225816
chargesum: 0.00000
title: Mulliken charges with hydrogens summed into heavy atoms:
elementType: N C C C C C C C C C
charge: -0.164475 0.060808 0.065308 -0.006431 -0.009970 0.372946 -0.077330 -0.019891 -0.034539 -0.186426
polarizability: 1.31473119e+02 8.16128372e+00 1.00274206e+02 -1.18274337e+00 -4.76391335e-01 7.30958724e+01
1716.lowfreq: -13.1347 0.0004 0.0007 0.0008 9.1478 22.0335 64.8912 75.7123 142.8450
frequency: 63.9052 75.6227 142.8190 155.7853 177.6016 234.1402 241.7517 351.7641 451.1388 485.9089 572.4093 622.2875 707.2004 731.9946 802.9067 830.0656 856.0251 874.5407 892.3865 905.6661 912.6216 922.7776 958.3779 973.1618 980.8443 1044.2202 1059.2197 1063.3600 1121.1353 1123.6033 1147.8020 1164.1661 1177.0291 1183.2873 1202.2255 1215.6230 1235.0296 1271.5345 1282.1401 1289.1386 1302.5244 1309.2287 1315.4296 1335.1095 1347.4566 1402.8021 1462.1017 1467.1507 1469.9097 1474.7986 1483.9349 1495.5398 1504.9368 1651.0511 2906.2782 2932.0597 2934.3018 2957.2805 2972.1993 2991.9255 3005.1956 3006.2829 3009.7049 3020.3230 3024.2801 3067.2063 3073.2678 3086.9662 3162.8966
redmass: 3.3121 2.4689 1.9720 3.1392 2.0122 2.6851 1.6664 4.3231 3.7983 2.1636 1.8554 2.2230 2.3767 1.6175 2.3582 1.7607 1.8995 1.9114 1.6309 2.6218 2.2908 1.5236 2.5989 1.9646 1.6673 1.6949 1.9164 1.6344 1.5409 1.1673 1.3877 1.4698 2.4970 1.6837 1.2518 1.2661 1.2852 1.5201 1.2788 1.6430 1.3465 1.2334 1.4800 1.4785 1.7307 6.9174 1.0922 1.0896 1.0880 1.0957 1.1031 1.0799 1.0899 7.0718 1.0702 1.0621 1.0650 1.0632 1.1017 1.0806 1.0712 1.0772 1.0653 1.0892 1.0859 1.1046 1.1006 1.1054 1.0943
irintensity: 1.6699 0.4823 2.3750 0.5742 5.7444 0.2670 0.3859 0.4355 3.0917 4.7143 3.3062 2.9834 15.9917 44.1336 1.6814 1.0479 1.8566 3.9291 2.1465 0.4774 3.2748 3.9408 9.4213 10.8541 0.9370 0.6649 3.6681 0.6020 1.2917 8.3581 12.4275 0.6328 16.1895 6.3822 1.2701 8.6116 8.4911 10.3931 1.0119 17.2975 2.6660 0.8009 1.6951 0.8622 14.6796 141.0523 17.0009 9.4356 4.6828 12.3924 0.9267 1.6313 13.2570 252.2503 114.1063 57.9539 94.6586 49.8932 31.1018 23.0019 48.6850 33.8026 54.8842 56.8895 52.6234 65.2897 35.4917 64.4448 24.4150
temp: 298.150 k
press: 1.00000 atm
elementType: 7 6 6 6 6 6 6 6 6 6 1 1 1 1 1 1 1 1 1 1 1 1 1 1 1
symmnumber: 1
zpe: 584228.4 jmol-1
zpe.correction: 0.222521 hartree
zpe.thermalcorrener: 0.232223 hartree
zpe.thermalcorrenthalpy: 0.233167 hartree
zpe.thermalcorrgfe: 0.187247 hartree
zpe.sumelectzpe: -405.895880 hartree
zpe.sumelectthermal: -405.886178 hartree
zpe.sumelectthermalent: -405.885233 hartree
zpe.sumelectthermalfe: -405.931154 hartree
dipole: -1.9782 -0.8632 0.0474
dipole: 2.1589
quadrupole: -59.1627 -60.0474 -62.8876
quadrupole: -1.3652 -0.2446 -0.0038
quadrupole: 1.5365 0.6519 -2.1884 -1.3652 -0.2446 -0.0038
hfenergy: -406.1184007 hartree
pointgroup: C01 [X(C9H15N1)]
dipole: -0.7795025 -0.336771 0.0193539 debye
dipolederiv: -1.6126552 -0.3600837 0.0375315 -0.016204 -0.536099 0.0659378 -0.1079456 -0.0673518 -0.2871364 0.3052178 0.2615022 -0.0792505 0.4043496 0.4986851 -0.0868229 -0.0184687 -0.0811561 0.3546367 0.2491229 -0.1282983 0.0390053 -0.3725393 0.3772081 -0.0151348 0.0116848 -0.0445332 0.3364554 0.0455328 0.0475609 -0.0367092 0.0286918 0.0280332 -0.0365155 0.0089189 -0.0030548 0.1423528 0.0466519 -0.0419723 0.025231 -0.0192981 0.0170688 -0.0387879 -0.0259295 -0.0157328 0.14915 1.4475106 0.3945365 -0.0065396 0.3134408 0.2674184 0.0039676 0.0309536 0.0833207 0.0173104 -0.0918762 0.0249995 -0.0222134 0.0588734 0.0388423 -0.0057954 -0.0422953 -0.0244151 0.1992256 0.0773112 -0.0783034 -0.0399284 -0.0586153 0.0157395 0.0414945 0.0082926 0.007899 0.1505831 0.2211199 0.0760048 -0.0209347 -0.0083024 0.004753 0.0374178 0.0255744 0.0447396 0.2574945 -0.3897893 -0.1050433 0.0059806 -0.4366339 -0.2553346 -0.0148897 -0.0884231 -0.0415795 -0.4468027 -0.0276913 -0.047265 -0.0091675 -0.1291011 -0.0861896 0.0876224 0.0683038 0.1884998 -0.1878098 0.0310257 0.0758265 0.0525902 -0.005452 -0.1237173 -0.0752793 0.0461467 -0.10549 -0.0164722 0.0126802 -0.0138833 0.0272013 0.1033511 -0.055215 0.093033 -0.0285649 0.1408535 -0.1353539 0.0180448 -0.0907553 -0.0686447 0.0505123 -0.0845612 -0.0910626 0.0026487 -0.112307 -0.0631147 -0.092833 -0.116715 0.0476297 -0.1414474 -0.0272417 0.0368662 0.0871464 0.0631964 0.053386 0.0630194 0.0159421 -0.008846 0.0343088 0.0502158 0.0076565 -0.0680734 -0.0291922 -0.1663041 -0.0868006 0.1025589 -0.0480844 0.1367327 -0.0189938 0.0427563 -0.0868909 0.0633482 0.0497601 0.045403 -0.0112473 0.0227071 -0.0350314 0.0506117 0.0089652 0.090257 -0.0263428 -0.1649526 0.0299028 -0.073779 0.0559175 -0.064316 -0.08656 0.0856538 0.0544426 0.1251084 -0.0129076 0.0406864 0.0116888 -0.0329309 -0.0169522 -0.0322876 -0.0824959 -0.0386521 -0.1420243 -0.1225477 -0.1180913 0.1170929 0.0662495 0.1350435 -0.0259612 -0.0536015 0.1076773 -0.0748571 0.0335515 0.0458338 -0.0073124 -0.024148 -0.0105328 0.0461343 0.0197334 -0.090545 0.0559982 -0.1712688 -0.1299059 -0.0486769 0.1050444 0.0392472 0.050554 0.0296713 0.1977294 0.0771029 -0.1676583 -0.1299391 -0.1080762 -0.0857883 -0.0985868 -0.0166761 -0.0722815 -0.1510961 -0.1032323 -0.0153425 0.0005187 0.1036983 -0.0019026 0.1084616 -0.0964269 0.0118913 0.0071085 0.0212022 0.2137651 unknown
polarizability: 131.5295353|8.0466258|100.2154156|-1.2569543|-0.4531325|73.0982462 unknown
InChI: InChI=1S/C9H15N/c1-2-6-9(5-1)10-7-3-4-8-10/h5H,1-4,6-8H2
charge 0 multiplicity 1
25 atoms
N  -0.705275 -0.005953 -0.033463
C  -1.518343 -1.232205 0.093374
C  -1.523387 1.221377 0.002761
C  -2.941412 -0.744117 -0.268995
C  -2.961576 0.709751 0.273444
C  0.682116 0.04191 -0.033308
C  1.515191 -1.239803 -0.079967
C  2.95298 -0.738066 0.245914
C  2.959751 0.777076 -0.135919
C  1.487646 1.15764 -0.057748
H  -1.497857 -1.642002 1.129114
H  -1.159699 -2.026005 -0.587919
H  -1.449035 1.768277 -0.962017
H  -1.168265 1.910363 0.797495
H  -3.729632 -1.37935 0.17014
H  -3.06783 -0.74187 -1.367318
H  -3.729135 1.337695 -0.209772
H  -3.161611 0.701999 1.360958
H  1.168262 -2.008001 0.637706
H  1.461612 -1.694939 -1.091321
H  3.732364 -1.317176 -0.281193
H  3.134602 -0.839331 1.331893
H  3.371474 0.92923 -1.157841
H  3.599554 1.366635 0.550095
H  1.137206 2.193061 -0.089811
