program: Gaussian 09
title: 000081694
version: EM64L-G09RevD.01
frameworkgroup: C1[X(C14H12N2O7S2)]
method: RPBEPBE
basis: SDD
operation: Freq
keyword: #p
keyword: freq=noraman
keyword: PBEPBE/SDD
title: #p freq=noraman PBEPBE/SDD
converged: YES YES NO NO
title: Mulliken charges:
elementType: S S O O O O O O O N N C C C C C C C C C C C C C C H H H H H H H H H H H H
charge: 0.965950 0.990585 -0.557627 -0.562263 -0.215252 -0.488371 -0.490705 -0.494689 -0.487845 -0.295347 -0.035631 0.491102 0.484736 -0.234609 0.449148 -0.623103 -0.095036 -0.419083 -0.366002 -0.288680 -0.379186 -0.646308 0.194455 0.242632 -0.751026 0.303227 0.298512 0.283413 0.334542 0.312704 0.283935 0.283557 0.240090 0.258898 0.240403 0.385713 0.387165
chargesum: 0.00000
title: Mulliken charges with hydrogens summed into heavy atoms:
elementType: S S O O O O O O O N N C C C C C C C C C C C C C C
charge: 0.965950 0.990585 -0.171914 -0.175098 -0.215252 -0.488371 -0.490705 -0.494689 -0.487845 -0.295347 -0.035631 0.491102 0.484736 -0.234609 0.449148 -0.319877 -0.095036 -0.120571 -0.082589 0.045863 -0.066482 -0.078817 0.194455 0.242632 -0.011635
polarizability: 4.07289731e+02 -6.77587238e+00 2.76233557e+02 -1.39851321e+00 1.13268883e-01 1.35120254e+02
1716.lowfreq: -3.1542 -0.0014 -0.0013 -0.0011 3.1322 3.8190 23.6574 27.0510 38.6092
frequency: 23.6346 27.0377 38.6007 41.2221 65.5117 79.9060 90.0005 92.3764 129.2195 135.9564 136.7651 149.1977 159.5039 169.0029 171.8461 180.1063 205.8949 216.7549 236.9070 254.4423 282.6535 283.9802 290.3812 293.7942 313.8989 329.5845 341.6560 346.1619 370.8213 378.9771 410.9315 426.4780 442.4350 452.1245 483.3106 525.1115 536.5889 549.3236 566.9428 569.3061 578.4381 599.4245 610.3142 616.6460 660.0384 667.9497 751.2111 784.1065 797.9687 829.5812 836.4244 854.6817 870.9255 891.9245 892.7073 903.6930 912.9159 922.5747 962.7318 965.4275 971.6599 990.5459 991.2045 1007.5867 1032.1228 1042.3361 1049.5924 1052.7647 1080.7413 1127.7461 1130.5468 1161.4892 1192.4329 1196.6821 1221.6623 1277.7525 1307.0453 1329.4257 1361.0028 1395.0701 1403.9988 1405.1027 1420.5218 1426.2857 1452.1792 1456.8051 1457.5494 1504.4833 1566.3555 1586.5051 1595.1847 1630.4585 1648.5217 2982.5674 3018.5452 3057.8141 3071.4530 3113.4761 3148.5953 3149.8347 3171.6170 3181.9025 3190.6296 3477.5898 3479.1434
redmass: 8.7237 6.2243 9.0053 7.4129 7.2162 5.9183 8.6572 5.1179 4.2702 2.8752 1.6117 5.1231 2.4451 2.3961 2.7196 6.1195 2.6401 2.7458 4.8871 6.2605 5.8201 4.5586 4.3752 4.1220 5.3443 9.2473 7.7629 8.5198 4.5778 7.0456 9.6030 11.1231 2.4904 3.1394 5.2497 7.7353 9.8611 5.2821 5.7778 5.5487 6.1751 6.7010 6.3144 6.5221 2.9063 8.0746 6.7689 5.7124 2.3378 11.3050 11.7981 7.0905 1.8414 3.3064 1.8889 1.4286 1.5421 4.2940 1.8431 10.8706 12.6771 3.1727 2.4536 1.3400 1.5180 5.2840 1.1656 1.1904 1.9963 1.2722 2.8049 2.1659 1.6212 1.5348 1.7719 1.8464 3.2762 1.8055 3.2279 2.6654 1.3030 1.2556 7.2562 4.4903 1.1411 4.8593 1.0459 3.4305 8.1130 5.8900 7.2942 6.2980 11.9630 1.0381 1.0621 1.0970 1.0994 1.0986 1.0924 1.0935 1.0901 1.0922 1.0969 1.0662 1.0662
irintensity: 1.6753 0.8356 0.3507 0.0029 0.8215 0.1765 0.1771 2.3320 3.8875 8.8168 1.1144 5.3567 6.9261 29.9195 36.2447 2.6174 14.8698 18.0353 18.4167 18.2074 48.5674 34.1055 8.9082 32.3070 33.7396 11.5275 2.2610 2.7618 0.0145 12.0533 104.3567 70.5911 3.9374 6.4995 1.9564 57.0492 167.8615 22.3909 16.0650 42.5053 7.2616 17.1254 47.5104 14.9918 1.0644 19.6244 24.6595 2.3874 0.7054 76.4536 60.3519 19.1457 65.4204 25.5365 1.5691 0.3465 13.6463 6.3968 43.4616 81.4421 80.0816 6.0750 15.8086 0.7585 7.0921 41.6940 42.6684 109.4798 36.0557 0.0951 29.2490 54.7561 16.0665 12.5111 5.7988 45.0756 221.9504 48.0056 74.9703 28.2707 13.8304 51.3245 31.8076 9.1295 9.1210 135.8192 19.2254 173.3037 2.7173 40.9891 45.3792 148.6403 251.9694 20.0091 0.1224 10.5844 0.5413 6.6920 30.8694 19.7558 6.0617 1.5253 7.3993 49.7349 56.5388
temp: 298.150 k
press: 1.00000 atm
elementType: 16 16 8 8 8 8 8 8 8 7 7 6 6 6 6 6 6 6 6 6 6 6 6 6 6 1 1 1 1 1 1 1 1 1 1 1 1
symmnumber: 1
zpe: 641345.3 jmol-1
zpe.correction: 0.244276 hartree
zpe.thermalcorrener: 0.269380 hartree
zpe.thermalcorrenthalpy: 0.270325 hartree
zpe.thermalcorrgfe: 0.188090 hartree
zpe.sumelectzpe: -1970.715287 hartree
zpe.sumelectthermal: -1970.690182 hartree
zpe.sumelectthermalent: -1970.689238 hartree
zpe.sumelectthermalfe: -1970.771472 hartree
dipole: -9.2841 -2.5999 2.8378
dipole: 10.0503
quadrupole: -132.8039 -169.5939 -164.0273
quadrupole: 17.6107 13.2447 1.9304
quadrupole: 22.6711 -14.1189 -8.5523 17.6107 13.2447 1.9304
hfenergy: -1970.9595624 hartree
pointgroup: C01 [X(C14H12N2O7S2)]
dipole: 3.6763418 -0.9308108 -1.1193038 debye
polarizability: 406.9483391|9.560007|276.5599591|-0.5912846|1.6978753|135.135243 unknown
InChI: InChI=1S/C14H12N2O7S2/c1-8-4-14(17)16(15-8)10-2-3-12-9(5-10)6-11(24(18,19)20)7-13(12)25(21,22)23/h2-3,5-7,18,21H,4H2,1H3
charge 0 multiplicity 1
37 atoms
S  -2.951351 2.705126 0.082197
S  -3.689272 -2.807733 0.017075
O  -2.467308 3.163309 -1.651517
O  -3.952133 -2.835832 -1.819263
O  4.492638 2.228186 -0.056243
O  -4.554806 2.528073 0.176965
O  -2.197512 3.721545 1.09063
O  -2.891737 -4.142626 0.45932
O  -5.081893 -2.395677 0.727049
N  3.475418 0.055862 -0.053566
N  3.91307 -1.31693 -0.073025
C  -0.730178 0.839531 0.010984
C  -0.225606 -0.527074 -0.010043
C  -2.151733 0.992559 0.026603
C  2.07915 0.307429 -0.029475
C  1.179302 -0.767518 -0.030641
C  -2.510819 -1.353518 -0.002072
C  -1.151834 -1.620467 -0.018823
C  0.218874 1.911305 0.017724
C  -3.067771 -0.05063 0.015122
C  1.587959 1.658084 -0.003574
C  5.813036 0.087215 -0.094408
C  4.561027 0.974028 -0.066132
C  5.234078 -1.310351 -0.096238
C  6.020235 -2.584668 -0.121064
H  1.560483 -1.790976 -0.048416
H  -0.790914 -2.654889 -0.023515
H  -0.130618 2.946157 0.048984
H  -4.149026 0.12458 0.039084
H  2.302855 2.483471 0.000272
H  6.451847 0.290553 0.784254
H  6.422629 0.305103 -0.990155
H  6.659866 -2.637426 -1.022213
H  5.343965 -3.454137 -0.115952
H  6.692126 -2.652139 0.755248
H  -2.813776 4.086443 -1.828448
H  -4.696274 -3.478366 -2.011327
