program: Gaussian 09
title: 000081563
version: EM64L-G09RevD.01
frameworkgroup: C1[X(C4H6N8)]
method: RPBEPBE
basis: SDD
operation: Freq
keyword: #p
keyword: freq=noraman
keyword: PBEPBE/SDD
title: #p freq=noraman PBEPBE/SDD
converged: NO YES NO NO
title: Mulliken charges:
elementType: N N N N N N N N C C C C H H H H H H
charge: -0.330748 -0.010854 -0.121245 -0.093492 -0.066266 -0.620754 -0.655015 -0.589168 0.053363 0.283576 0.092007 -0.010873 0.394910 0.339804 0.329073 0.328976 0.334954 0.341752
chargesum: 0.00000
title: Mulliken charges with hydrogens summed into heavy atoms:
elementType: N N N N N N N N C C C C
charge: -0.330748 -0.010854 -0.121245 -0.093492 -0.066266 0.113960 0.003034 0.087538 0.053363 0.283576 0.092007 -0.010873
polarizability: 1.49475291e+02 4.69204682e-02 1.09101523e+02 1.66886986e-02 3.63998648e-02 4.52420469e+01
1716.lowfreq: -7.5779 -3.4499 -0.0006 -0.0003 0.0006 1.7075 68.6955 152.9184 198.5315
frequency: 68.6832 152.9158 198.5315 231.0374 238.4640 252.5479 315.5492 381.6117 399.0794 470.4969 487.7191 537.4022 537.5847 545.7256 608.5240 617.6096 621.9818 675.3479 694.5407 700.5998 764.0156 766.1566 803.9287 823.8809 909.9863 970.1671 1021.5546 1082.6732 1163.4058 1168.1230 1176.1074 1197.9289 1302.6697 1372.7424 1411.8691 1460.6965 1495.3410 1530.7329 1582.2662 1609.5169 1644.4816 1649.8583 3328.7342 3438.5094 3539.1418 3561.4830 3651.1502 3721.4588
redmass: 2.7589 4.2735 4.7849 3.5641 1.9690 4.2114 2.8299 6.7148 4.2248 1.1701 5.7722 2.5770 1.4966 1.1742 4.6569 7.1740 6.6873 9.6765 6.6940 10.3472 6.5096 2.1555 1.1609 3.0879 3.3761 6.9807 5.1586 3.6751 4.7339 2.2276 1.2480 9.9937 8.8486 5.0638 5.3800 5.6247 4.2186 2.2448 1.6468 2.1418 4.3338 1.1040 1.0612 1.0455 1.0965 1.0443 1.0916 1.1061
irintensity: 16.0140 0.0006 1.6299 2.4989 5.4527 3.5726 15.7786 1.9872 3.7381 223.1664 1.8008 41.7880 69.8915 162.2537 6.1891 16.0870 0.6638 2.5232 3.0375 1.0625 2.1862 109.3472 160.9938 29.7389 13.9894 8.5642 0.9486 14.5555 7.8494 12.2137 0.6567 18.0851 66.7664 36.0054 165.2729 36.0523 38.7664 151.2485 255.9437 968.1066 380.8247 21.3139 216.5872 4.9687 21.6779 145.3726 99.2359 54.8300
temp: 298.150 k
press: 1.00000 atm
elementType: 7 7 7 7 7 7 7 7 6 6 6 6 1 1 1 1 1 1
symmnumber: 1
zpe: 340245.1 jmol-1
zpe.correction: 0.129593 hartree
zpe.thermalcorrener: 0.139442 hartree
zpe.thermalcorrenthalpy: 0.140386 hartree
zpe.thermalcorrgfe: 0.094694 hartree
zpe.sumelectzpe: -593.164573 hartree
zpe.sumelectthermal: -593.154723 hartree
zpe.sumelectthermalent: -593.153779 hartree
zpe.sumelectthermalfe: -593.199472 hartree
dipole: -0.1393 7.6853 -0.0018
dipole: 7.6865
quadrupole: -47.4026 -77.8306 -69.2138
quadrupole: 11.1466 0.0011 -0.0096
quadrupole: 17.4131 -13.0149 -4.3982 11.1466 0.0011 -0.0096
hfenergy: -593.2941651 hartree
pointgroup: C01 [X(C4H6N8)]
dipole: -0.3438261 3.000002 -0.1645045 debye
dipolederiv: -0.6682141 0.2064404 -0.0292282 0.1654905 -1.0713045 0.0662879 -0.025749 0.0688955 0.1083145 -1.4688844 0.072136 -0.0356575 0.5341922 -0.631362 0.0335041 -0.0580449 0.0208459 -0.2527372 -1.1044882 -0.5541294 0.0072974 -0.3001676 -0.9125909 0.0254854 -0.0057636 0.0189814 -0.2752103 -0.7625992 -0.2095425 -0.002672 0.3859696 -0.1520513 0.0038962 -0.033012 -0.0128556 -0.2739865 -0.1082141 0.2818791 -0.0103617 0.02394 -0.0969881 -0.005167 0.0025907 -0.0001953 -0.2434304 -0.6183213 -0.4207796 0.0228353 -0.380484 -1.2279603 0.0170542 0.0198754 0.0115864 -0.6720425 -0.6349211 -0.0288985 -0.0127884 -0.0874652 -0.6619266 0.0280892 -0.0081204 0.0306752 -0.1463143 -1.7538788 -0.0541844 -0.0238821 -0.1502054 -0.2153099 -0.0292872 -0.0194716 -0.0268873 -0.7152536 1.355788 0.071904 0.0279969 -0.3615212 0.5120263 -0.0300804 0.0493327 -0.0168915 0.1408513 1.25499 0.5225199 -0.0026308 0.2588312 1.6640752 -0.0643662 0.0111291 -0.0579458 0.2746558 0.7752824 0.1537164 0.0126264 0.0859825 0.3448859 -0.0183157 0.0138277 -0.016017 0.0052926 2.2950771 0.1233592 0.0470293 -0.1197672 1.0471897 -0.0468589 0.0597472 -0.0401395 0.2057593 0.4608039 -0.0357058 0.005059 -0.0542808 0.2629047 0.0034532 0.0067311 0.0051193 0.3453927 0.1395018 -0.0011224 -0.006722 0.0251435 0.2929891 0.006286 -0.0077247 0.0078119 0.3881739 0.1410462 -0.0741083 0.0645432 -0.023555 0.2363587 -0.0823256 0.0308297 -0.0340517 0.172075 0.1446003 -0.0848232 -0.0559708 -0.0313576 0.2504029 0.0696845 -0.0289714 0.0183257 0.1519441 0.2887675 -0.0070135 -0.0022292 -0.0726024 0.1738444 0.0092304 0.0011814 0.0109204 0.3915816 0.2636641 0.0383524 -0.0052447 0.1018568 0.1848167 0.0134298 -0.0083872 0.0118221 0.3949339 unknown
polarizability: 149.0267155|4.0241971|109.3239324|2.485604|-3.1676578|45.4682134 unknown
InChI: InChI=1S/C4H6N8/c5-1-8-2(6)12-3(7)10-11-4(12)9-1/h5-7H2
charge 0 multiplicity 1
18 atoms
N  0.512448 0.233543 0.020782
N  -1.376097 -1.300369 0.051223
N  -1.672223 1.147482 -0.080999
N  0.998439 -1.990283 0.149294
N  2.206742 -1.232457 0.142869
N  0.234757 2.56446 -0.105305
N  2.792358 1.195873 0.030264
N  -3.495514 -0.314725 -0.052413
C  -0.027656 -1.09306 0.075112
C  -0.34791 1.334353 -0.057382
C  1.911181 0.079233 0.068115
C  -2.131115 -0.17614 -0.02471
H  1.266734 2.600578 -0.08439
H  -0.362817 3.384925 -0.168568
H  3.400199 1.210184 -0.797443
H  3.343552 1.313167 0.889077
H  -4.080065 0.51418 -0.109235
H  -3.893713 -1.249446 -0.014491
