program: Gaussian 09
title: 000081549
version: EM64L-G09RevD.01
frameworkgroup: C1[X(C6H10N2O2)]
method: RPBEPBE
basis: SDD
operation: Freq
keyword: #p
keyword: freq=noraman
keyword: PBEPBE/SDD
title: #p freq=noraman PBEPBE/SDD
converged: NO NO NO NO
title: Mulliken charges:
elementType: O O N N C C C C C C H H H H H H H H H H
charge: -0.254057 -0.187925 0.003668 -0.446441 0.193009 -0.693441 -0.688900 -0.688904 0.168071 0.213047 0.226744 0.226737 0.210729 0.220844 0.240453 0.218269 0.240451 0.220845 0.218266 0.358533
chargesum: 0.00000
title: Mulliken charges with hydrogens summed into heavy atoms:
elementType: O O N N C C C C C C
charge: -0.254057 -0.187925 0.003668 -0.087908 0.193009 -0.029230 -0.009333 -0.009342 0.168071 0.213047
polarizability: 1.07791086e+02 -1.28093217e+00 7.98591749e+01 1.32860635e-04 8.88349022e-05 6.05535589e+01
1716.lowfreq: -14.0623 -8.2497 -7.7433 0.0006 0.0008 0.0010 47.6416 108.2202 158.5263
frequency: 46.9955 108.1595 158.5224 177.5658 238.7055 247.4029 253.4852 301.0536 316.8806 340.6107 411.1375 434.1870 528.8860 564.3766 600.7646 674.9876 699.4322 710.8462 797.3706 824.3376 889.7478 926.7117 939.0652 956.9826 1001.8678 1027.2858 1035.3247 1116.2676 1154.8524 1203.9318 1223.6939 1293.5463 1366.6061 1377.4023 1383.2550 1409.6654 1454.7071 1464.5183 1467.2060 1477.3927 1479.0562 1494.3500 1554.1510 1767.0127 2986.2218 2987.7942 2994.5657 3083.3623 3086.8673 3095.2427 3095.7618 3100.7047 3101.2806 3647.4758
redmass: 4.5035 4.1690 3.4662 1.0224 1.7441 1.0749 1.7740 3.0062 2.8218 2.8017 3.7010 4.2413 5.7768 3.1625 1.1556 8.1529 9.2106 9.6359 10.4919 3.0243 8.5365 1.7919 1.6469 1.2011 2.6644 1.3948 1.7747 4.8081 4.4880 2.7775 3.1188 3.7517 1.4190 1.1799 1.1959 1.2129 1.0474 1.0502 1.0472 1.0487 1.0527 1.1284 6.2967 11.1821 1.0345 1.0350 1.0355 1.1009 1.1003 1.1001 1.1011 1.1001 1.1001 1.0824
irintensity: 2.1801 0.5142 0.3137 0.0161 0.0681 0.0056 0.0574 1.8853 0.2124 1.8084 0.6828 2.5934 8.0458 0.4151 160.9569 1.2064 4.4620 7.0773 129.0466 3.9278 2.8823 2.5952 2.5080 0.0040 17.4043 0.0007 5.5389 84.1309 55.5857 7.2781 6.0286 17.8323 8.4907 19.7276 19.6063 9.2931 0.0113 0.1368 0.9055 14.7373 16.0314 14.2117 52.8919 596.9735 28.7141 15.7761 22.4474 11.8102 17.3255 47.7820 1.4499 31.2857 42.2476 94.1811
temp: 298.150 k
press: 1.00000 atm
elementType: 8 8 7 7 6 6 6 6 6 6 1 1 1 1 1 1 1 1 1 1
symmnumber: 1
zpe: 419169.0 jmol-1
zpe.correction: 0.159653 hartree
zpe.thermalcorrener: 0.170005 hartree
zpe.thermalcorrenthalpy: 0.170949 hartree
zpe.thermalcorrgfe: 0.124145 hartree
zpe.sumelectzpe: -493.801527 hartree
zpe.sumelectthermal: -493.791175 hartree
zpe.sumelectthermalent: -493.790231 hartree
zpe.sumelectthermalfe: -493.837035 hartree
dipole: -2.9691 2.0135 -0.0001
dipole: 3.5874
quadrupole: -63.4022 -61.7601 -58.7955
quadrupole: 10.9411 -0.0002 0.0000
quadrupole: -2.0830 -0.4408 2.5238 10.9411 -0.0002 0.0000
hfenergy: -493.9611799 hartree
pointgroup: C01 [X(C6H10N2O2)]
dipole: 1.1712277 0.7875767 0.0007289 debye
dipolederiv: -1.2889413 -0.3059666 -0.0004434 0.1465858 -0.4887989 -0.0001486 -0.0001538 -0.0002832 -0.1278664 -1.3142916 -0.397208 -0.0004233 -0.5118533 -0.5977581 -0.0002471 -0.0005454 -0.0002515 -0.3402035 0.1726202 -0.1351143 -0.0000133 0.2143409 -0.4246719 -0.0001308 0.0001714 -0.0001458 -0.1389012 -0.6524866 0.1703167 0.0000085 -0.5344367 -0.5043251 -0.0002293 -0.0003434 -0.000091 -0.3319202 0.1339037 0.0027771 0.0000089 0.0539129 0.0403439 -0.0000306 0.0001289 -0.0000772 0.1121246 -0.0026807 -0.040461 -0.0000394 0.0005834 -0.0328087 -0.0000324 -0.0000123 -0.0000393 0.0316327 -0.051508 0.0143154 0.0124136 -0.0319494 0.0148625 -0.0394045 -0.0601617 -0.0271738 0.0021966 -0.0514835 0.0143199 -0.0124176 -0.0320754 0.0147787 0.0393986 0.0600585 0.0272003 0.0023135 0.7929531 0.0655919 0.0002369 0.1068399 0.5339048 0.0003324 0.0001605 0.0003444 -0.010016 2.0384102 0.5974426 0.0007047 0.5766307 1.0407703 0.0005152 0.0007167 0.0005456 0.3241346 0.101289 0.0294202 -0.0534236 -0.0043618 0.008006 0.0888512 -0.0294089 0.1154165 -0.0673058 0.1012378 0.0293784 0.0535323 -0.0043777 0.0082955 -0.0887547 0.0294604 -0.1153043 -0.0675848 -0.1699844 0.0245457 -0.0000315 0.079509 0.0683234 -0.0000123 0.0000059 -0.0000219 0.1017079 0.0998987 0.0302403 -0.0394358 0.019557 0.0139927 0.1250894 -0.0248209 0.0705376 -0.0962408 0.0565183 -0.1154664 -0.0098998 -0.0972683 -0.0630415 -0.034162 0.0021045 0.006011 0.0788581 -0.1629122 0.0774499 0.0164122 0.0735664 0.076459 -0.0211944 -0.0027862 -0.0130911 0.0760365 0.0565519 -0.1154538 0.0096993 -0.09725 -0.0631413 0.0338996 -0.0022745 -0.0062837 0.0789005 0.0998575 0.0302366 0.0396286 0.0196172 0.0142913 -0.1248976 0.0249985 -0.0703581 -0.0964936 -0.1629347 0.0774156 -0.0164491 0.073495 0.0764413 0.0212322 0.0027636 0.0131389 0.0760768 0.2039827 -0.0537802 -0.0000682 -0.0510655 0.2640759 -0.0000742 -0.0000617 -0.0000737 0.3925506 unknown
polarizability: 107.8007353|1.170934|79.8495174|0.0117939|0.0104788|60.5535672 unknown
InChI: InChI=1S/C6H10N2O2/c1-6(2,3)4-7-8-5(9)10-4/h8H,1-3H3
charge 0 multiplicity 1
20 atoms
O  -0.793055 -0.851362 -0.000728
O  -3.19227 -0.854823 -0.00127
N  -0.431871 1.414218 0.000562
N  -1.818234 1.120455 0.000144
C  1.611869 -0.115034 0.000256
C  2.434499 1.198121 0.001373
C  1.933862 -0.954619 -1.273447
C  1.933275 -0.956408 1.272937
C  0.141852 0.217107 0.000136
C  -2.11996 -0.236069 -0.000647
H  2.214886 1.809847 -0.890495
H  2.21459 1.808543 0.894063
H  3.510693 0.94956 0.001377
H  1.73407 -0.374466 -2.192096
H  1.330878 -1.878193 -1.303946
H  3.00304 -1.232962 -1.265763
H  1.330514 -1.880185 1.301713
H  1.732754 -0.377671 2.192319
H  3.002529 -1.234475 1.265523
H  -2.491519 1.880915 0.000389
