program: Gaussian 09
title: 000081551
version: EM64L-G09RevD.01
frameworkgroup: C1[X(C3H3Cl2F3)]
method: RPBEPBE
basis: SDD
operation: Freq
keyword: #p
keyword: freq=noraman
keyword: PBEPBE/SDD
title: #p freq=noraman PBEPBE/SDD
converged: NO NO NO NO
title: Mulliken charges:
elementType: Cl Cl F F F C C C H H H
charge: 0.078843 0.078725 -0.148837 -0.129007 -0.148633 -0.467034 0.524205 -0.573862 0.257591 0.270429 0.257581
chargesum: 0.00000
title: Mulliken charges with hydrogens summed into heavy atoms:
elementType: Cl Cl F F F C C C
charge: 0.078843 0.078725 -0.148837 -0.129007 -0.148633 -0.467034 0.524205 0.211739
polarizability: 4.55456345e+01 -5.42554438e-03 6.34026071e+01 -4.73117165e+00 8.81031911e-04 4.79352111e+01
1716.lowfreq: -8.3738 0.0023 0.0025 0.0029 9.9623 10.4274 75.5214 167.8286 186.6954
frequency: 75.4636 167.8283 186.6852 241.6992 270.6799 277.7163 287.7619 338.0838 349.6884 443.9889 479.5308 523.1371 614.8588 686.9499 768.6243 1030.5488 1036.5918 1067.6251 1086.8878 1097.9045 1214.9573 1403.3419 1456.2029 1457.1922 3011.3917 3114.2093 3130.1861
redmass: 15.2906 17.7820 9.2573 20.0432 1.0508 4.5901 4.4189 6.7193 11.1746 9.6625 18.0749 9.1806 9.0086 4.6738 4.4847 12.7443 3.6973 6.3289 1.5594 3.6184 5.1176 1.1881 1.0412 1.0487 1.0352 1.1009 1.1007
irintensity: 0.2343 2.2023 1.8671 1.3634 0.0041 2.7058 0.1504 1.4192 0.5906 12.4593 7.9053 7.0232 21.8248 89.1620 14.0808 154.4308 213.4830 134.9142 72.7730 34.0101 45.1156 23.9175 9.5171 19.8899 0.7809 2.6736 2.4376
temp: 298.150 k
press: 1.00000 atm
elementType: 17 17 9 9 9 6 6 6 1 1 1
symmnumber: 1
zpe: 154436.3 jmol-1
zpe.correction: 0.058822 hartree
zpe.thermalcorrener: 0.067462 hartree
zpe.thermalcorrenthalpy: 0.068406 hartree
zpe.thermalcorrgfe: 0.024816 hartree
zpe.sumelectzpe: -1335.126347 hartree
zpe.sumelectthermal: -1335.117706 hartree
zpe.sumelectthermalent: -1335.116762 hartree
zpe.sumelectthermalfe: -1335.160352 hartree
dipole: 1.1285 -0.0004 2.4325
dipole: 2.6815
quadrupole: -61.8567 -60.3652 -56.1256
quadrupole: 0.0031 1.1058 -0.0001
quadrupole: -2.4075 -0.9161 3.3236 0.0031 1.1058 -0.0001
hfenergy: -1335.1851687 hartree
pointgroup: C01 [X(C3H3Cl2F3)]
dipole: -0.6118825 -0.0054487 -0.8593968 debye
dipolederiv: -0.1659921 0.1483456 0.0604873 0.0805795 -0.5230505 -0.1618837 0.0407593 -0.2034343 -0.2328403 -0.1660415 -0.1474977 0.0621794 -0.07996 -0.5189613 0.1652845 0.0416581 0.2068192 -0.2372355 -0.5068998 -0.2420148 0.137019 -0.1442357 -0.5863262 0.2056839 0.0605125 0.1767569 -0.3933134 -0.4344789 -0.0011643 -0.2163552 -0.0008884 -0.2498793 -0.0024222 -0.1655474 -0.0024667 -0.7328237 -0.5069795 0.2435138 0.1346769 0.1448554 -0.5899971 -0.203833 0.0591518 -0.1749708 -0.3896185 0.2187395 -0.0007139 -0.0941667 -0.0011586 1.2126254 -0.0035741 -0.1633046 -0.0034973 0.6140787 1.5003069 -0.0004738 -0.0823291 0.0006015 1.2330103 0.0009908 0.0928641 0.0009914 1.3890807 -0.1166439 -0.0001071 -0.0170165 -0.0001122 -0.1251093 -0.0005353 -0.0231746 -0.0005249 -0.2152817 0.1134792 0.0604431 0.0144627 0.0569996 0.0063767 -0.0548178 0.028439 -0.0545908 0.0511092 -0.0489969 -0.0001101 -0.0141134 -0.0000396 0.133698 -0.0002301 -0.0004505 -0.0002091 0.0970496 0.113507 -0.0602209 0.0151555 -0.0566414 0.0076134 0.0553368 0.0290923 0.0551266 0.0497948 unknown
polarizability: 43.9207357|-0.0241254|63.4020837|-3.9824979|-0.0852803|49.5606332 unknown
InChI: InChI=1S/C3H3Cl2F3/c1-2(4,5)3(6,7)8/h1H3
charge 0 multiplicity 1
11 atoms
Cl -1.40849 1.528547 0.724812
Cl -1.407929 -1.519226 0.742843
F  1.367695 1.130327 -0.583998
F  1.215139 0.007605 1.382027
F  1.368065 -1.134059 -0.572854
C  -0.746119 -0.000216 -0.128683
C  0.80039 0.000883 0.044185
C  -1.171132 -0.009021 -1.591068
H  -0.784595 -0.91229 -2.092875
H  -2.270303 -0.009623 -1.65225
H  -0.784921 0.888372 -2.103539
