program: Gaussian 09
title: 000081576
version: EM64L-G09RevD.01
frameworkgroup: C1[X(C10H16O5)]
method: RPBEPBE
basis: SDD
operation: Freq
keyword: #pfreq=noraman
keyword: PBEPBE/SDD
title: #p freq=noraman PBEPBE/SDD
converged: YES YES NO NO
title: Mulliken charges:
elementType: O O O O O C C C C C C C C C C H H H H H H H H H H H H H H H H
charge: -0.262690 -0.256837 -0.197133 -0.251033 -0.231615 -0.504178 -0.512133 0.235029 -0.607918 0.254205 0.273856 -0.227846 -0.219367 -0.671017 -0.674414 0.281102 0.244498 0.283071 0.254218 0.260056 0.257801 0.228052 0.230468 0.226978 0.237959 0.212549 0.232087 0.229822 0.211788 0.226974 0.235668
chargesum: 0.00000
title: Mulliken charges with hydrogens summed into heavy atoms:
elementType: O O O O O C C C C C C C C C C
charge: -0.262690 -0.256837 -0.197133 -0.251033 -0.231615 0.021422 0.025156 0.235029 -0.090060 0.254205 0.273856 0.230674 0.245570 0.003440 0.000017
polarizability: 1.67559042e+02 -2.14890779e+00 1.15477434e+02 2.06659214e+00 -1.41090257e+00 9.54077981e+01
1716.lowfreq: -12.2860 -2.4032 -0.0007 -0.0006 -0.0002 4.7759 12.4095 17.2771 22.6586
frequency: 11.3563 16.2445 22.5984 41.8816 50.3444 58.1222 63.1024 79.6869 118.3510 144.4594 160.9799 175.6497 186.6426 232.0122 248.4540 260.5021 296.3443 341.5198 354.0788 391.4971 441.3064 457.1196 544.5466 564.4712 622.4079 668.2462 737.1503 767.0701 793.5881 797.9522 798.5950 814.7367 859.0161 897.2330 923.8542 937.2578 1010.7670 1018.5158 1025.6958 1051.1017 1101.1783 1109.1206 1114.1232 1117.0407 1135.6093 1135.8594 1140.9474 1169.2909 1237.3497 1246.1982 1249.6730 1250.3337 1280.7944 1310.2758 1351.7192 1358.3961 1367.6508 1401.0791 1401.2080 1419.8199 1437.0947 1448.1429 1463.2926 1463.4912 1473.5447 1473.7154 1486.4016 1486.5947 1631.5592 1635.1754 1654.6657 2970.5689 2996.4124 2996.5964 2999.6775 3010.7588 3010.9493 3012.4934 3028.6541 3069.7234 3072.1534 3075.5478 3078.2651 3093.0215 3093.3251 3108.7678 3108.9108
redmass: 3.7106 4.0817 3.5743 3.3538 3.9798 3.4812 3.8389 3.6060 2.6523 2.2534 3.7020 2.6279 3.5712 3.0367 1.3039 1.7270 5.3300 3.6674 3.6146 2.1906 3.1738 2.8397 4.3002 4.4410 4.9970 5.0675 2.6205 2.5379 2.7172 1.1244 1.1102 3.6356 3.5541 3.1014 4.8101 3.6269 2.0412 2.4105 2.4662 3.5515 1.8077 2.0920 2.2516 1.9972 1.4901 1.4697 2.7032 1.6361 1.5879 1.3461 1.1356 1.1558 1.5335 1.5330 1.4756 1.3848 1.7703 1.2699 1.2633 1.1240 1.0908 1.0907 1.0401 1.0401 1.0643 1.0606 1.0656 1.0686 9.4727 8.6469 9.6657 1.0634 1.0359 1.0359 1.0651 1.0604 1.0581 1.0583 1.0938 1.1067 1.1064 1.0958 1.1000 1.0985 1.0985 1.1026 1.1028
irintensity: 0.7857 0.0907 0.1281 1.8250 1.0045 2.0103 2.7848 1.1379 2.4335 7.8173 6.0842 3.6342 11.0748 8.6930 1.6739 1.4313 6.7020 13.5812 1.3033 1.5203 2.7517 18.9020 14.6961 6.2854 7.5725 0.7660 4.6035 14.7225 0.1455 5.7214 3.4791 6.5613 18.8574 25.9794 26.2095 7.2440 3.1618 102.2335 21.0312 39.8485 105.5520 59.7760 1.0146 5.3279 17.4530 6.2436 429.3361 52.0004 57.2681 224.8207 2.7186 20.5447 66.6166 190.9967 4.2089 3.5718 4.6160 16.4783 25.7698 24.7275 18.4776 57.0528 12.0051 12.1364 3.1906 4.8541 14.2081 14.4093 285.9594 3.6545 169.3180 26.1992 20.7228 21.1511 25.2998 3.5891 17.1104 18.8726 9.7141 7.8576 5.7249 5.7420 4.0446 30.9214 28.6465 40.3425 46.3401
temp: 298.150 k
press: 1.00000 atm
elementType: 8 8 8 8 8 6 6 6 6 6 6 6 6 6 6 1 1 1 1 1 1 1 1 1 1 1 1 1 1 1 1
symmnumber: 1
zpe: 653529.7 jmol-1
zpe.correction: 0.248916 hartree
zpe.thermalcorrener: 0.267040 hartree
zpe.thermalcorrenthalpy: 0.267984 hartree
zpe.thermalcorrgfe: 0.197233 hartree
zpe.sumelectzpe: -765.603992 hartree
zpe.sumelectthermal: -765.585869 hartree
zpe.sumelectthermalent: -765.584925 hartree
zpe.sumelectthermalfe: -765.655676 hartree
dipole: 1.1768 1.8228 2.8749
dipole: 3.6018
quadrupole: -65.1208 -96.6137 -89.1619
quadrupole: -1.8584 -4.9523 -3.5883
quadrupole: 18.5114 -12.9816 -5.5298 -1.8584 -4.9523 -3.5883
hfenergy: -765.8529088 hartree
pointgroup: C01 [X(C10H16O5)]
dipole: 0.4496752 -0.4423761 1.2689029 debye
polarizability: 167.6958518|0.2601862|103.9519129|0.8375748|10.0136156|106.7965098 unknown
InChI: InChI=1S/C10H16O5/c1-3-14-9(12)6-5-8(11)7-10(13)15-4-2/h3-7H2,1-2H3
charge 0 multiplicity 1
31 atoms
O  4.037554 0.384634 0.403196
O  -3.961429 -0.598033 0.130223
O  -1.032545 0.796894 -0.342822
O  3.380983 -0.965042 -1.378984
O  -3.586281 -0.677844 -2.171402
C  0.656811 -0.970693 -0.414514
C  1.682848 0.045456 0.111045
C  -0.769985 -0.427077 -0.437286
C  -1.869754 -1.495737 -0.602874
C  3.085947 -0.25864 -0.385046
C  -3.208049 -0.897723 -0.999585
C  5.465349 0.226207 -0.022907
C  -5.259548 0.107547 -0.115615
C  6.307009 1.04391 0.950631
C  -5.871854 0.391319 1.251384
H  0.927573 -1.252405 -1.454676
H  0.685689 -1.91749 0.158466
H  1.398796 1.0575 -0.240229
H  1.68731 0.102515 1.212812
H  -1.964172 -2.029952 0.361266
H  -1.551723 -2.225431 -1.368518
H  5.71455 -0.850141 -0.00176
H  5.555823 0.579562 -1.065939
H  -5.894577 -0.54615 -0.740746
H  -5.042939 1.028508 -0.685539
H  7.375439 0.964259 0.679041
H  6.019655 2.10872 0.921626
H  6.18294 0.677981 1.984116
H  -6.834979 0.919027 1.126549
H  -6.058463 -0.545195 1.804467
H  -5.203077 1.027114 1.855921
