program: Gaussian 09
title: 000081597
version: EM64L-G09RevD.01
frameworkgroup: C1[X(C17H26O3)]
method: RPBEPBE
basis: SDD
operation: Freq
keyword: #pfreq=noraman
keyword: PBEPBE/SDD
title: #p freq=noraman PBEPBE/SDD
converged: YES YES NO NO
title: Mulliken charges:
elementType: O O O C C C C C C C C C C C C C C C C C H H H H H H H H H H H H H H H H H H H H H H H H H H
charge: -0.270717 -0.417844 -0.231039 -0.385168 -0.383432 -0.380543 -0.384978 -0.376650 -0.368861 -0.406907 -0.375800 -0.317032 -0.488186 0.170965 0.369093 -0.351844 -0.381553 -0.223236 -0.197642 -0.258455 0.194128 0.195204 0.194197 0.194154 0.196452 0.196529 0.196269 0.196913 0.190738 0.193948 0.191666 0.191617 0.214655 0.216319 0.218145 0.217572 0.205938 0.205374 0.252300 0.252355 0.247432 0.249013 0.375271 0.221550 0.225708 0.226384
chargesum: 0.00000
title: Mulliken charges with hydrogens summed into heavy atoms:
elementType: O O O C C C C C C C C C C C C C C C C C
charge: -0.270717 -0.042572 -0.231039 0.004164 0.004919 0.012438 0.008204 0.008036 0.014421 0.024067 0.059917 0.094280 0.016469 0.170965 0.369093 -0.104412 -0.132540 -0.001687 0.028066 -0.032071
polarizability: 2.83469703e+02 -3.14813025e+00 1.79569214e+02 1.91496694e-01 1.15604883e+00 1.20678480e+02
1716.lowfreq: -41.1691 -5.0603 -0.0014 0.0011 0.0016 2.4074 9.4766 14.1990 17.1024
frequency: -33.0902 10.4711 15.3602 17.1843 29.9571 49.8611 56.2536 68.4132 86.3284 98.2794 107.3521 120.4094 126.3369 137.3965 149.2095 158.3377 166.6236 232.9261 242.8502 257.0504 327.5491 377.5233 412.6207 413.3926 471.6097 479.0998 500.4870 503.8617 511.7005 582.7671 589.3861 610.5950 638.5871 692.7266 719.2566 723.5974 735.5458 757.4605 761.2552 788.0928 797.4589 823.3198 846.9596 856.5746 888.7824 903.4302 959.9181 962.7239 965.4568 981.2975 983.1141 988.7583 995.2924 1019.2469 1021.8981 1023.6528 1042.6051 1055.9505 1075.7585 1082.1080 1082.6778 1083.3492 1090.5848 1113.4888 1116.6244 1149.8336 1166.5091 1177.4531 1194.0861 1204.0858 1218.7321 1223.3613 1231.8438 1251.0388 1252.9211 1275.5929 1276.9672 1279.2523 1287.3523 1290.3566 1297.7641 1299.8622 1304.3442 1313.0562 1330.1801 1349.6564 1355.4417 1359.2654 1370.7603 1377.0917 1392.2124 1435.9417 1443.2380 1459.3466 1460.0523 1463.4500 1466.9023 1469.1683 1473.0915 1477.5337 1482.7948 1486.9822 1492.9281 1590.5120 1612.4666 1669.3097 2942.6632 2948.4502 2949.7922 2951.9344 2954.2309 2959.6142 2965.3417 2982.7688 2984.7584 2988.2048 2993.5889 2994.2018 2995.0985 2999.4837 3007.6048 3023.2142 3030.0548 3039.2812 3060.0161 3062.3471 3126.3981 3135.2640 3154.7340 3163.4241 3172.0767 3510.9457
redmass: 1.7733 5.4390 6.6016 5.6323 4.6897 4.8984 4.0258 1.7688 3.1734 4.8433 1.9324 2.3837 5.9043 2.0145 2.0609 2.1745 4.5225 5.0334 4.3000 5.0664 3.9834 4.2373 2.9393 3.9239 3.7273 3.7136 1.7881 2.8521 3.3166 6.0501 4.7189 6.4233 1.3116 2.0231 1.0700 1.0834 1.1184 1.5374 1.2387 6.1065 1.2306 1.2509 1.2705 4.8192 1.4506 1.2858 1.3833 2.7669 1.7118 1.2995 5.8045 4.8923 5.2218 1.1958 2.0619 3.0882 3.5197 2.9387 2.4245 2.1460 2.2608 1.6042 2.4703 3.9482 1.4735 1.3979 1.0846 1.1743 1.5848 1.2783 3.3208 1.4049 1.3500 1.3884 1.3147 1.2495 1.3103 1.0330 1.0676 1.1102 1.1099 1.1132 1.3999 1.3421 1.4459 1.5108 1.7085 1.6043 1.8500 2.0492 2.9890 1.0847 2.3776 1.0730 1.0717 1.0705 1.0767 1.1446 1.3079 1.2818 1.1768 1.1512 1.1528 6.3998 6.2419 8.2180 1.0550 1.0586 1.0585 1.0591 1.0591 1.0593 1.0586 1.0963 1.0614 1.0979 1.0595 1.0607 1.0995 1.1050 1.1035 1.1033 1.1010 1.1047 1.1032 1.1048 1.0847 1.0890 1.0926 1.0950 1.1004 1.0639
irintensity: 0.1694 0.0185 1.6758 0.2668 0.0309 0.1260 0.1254 0.4533 0.8443 0.4723 0.2802 0.2353 0.2182 1.5306 0.0133 1.9223 1.5595 0.5927 1.1504 4.1738 0.1872 1.6143 0.0540 3.5632 11.3565 8.8731 28.0615 12.2492 9.3081 13.7867 7.6880 0.5935 128.8945 35.5663 19.1898 1.0803 9.7372 67.9401 21.6816 20.8721 1.9322 1.0060 0.4972 1.2485 8.9501 0.0899 1.5572 23.9692 14.8141 0.6725 1.1823 58.1075 37.6191 3.8622 48.4812 74.9052 4.7488 121.4849 1.2084 0.3142 9.0743 10.1952 5.7541 11.8740 0.9997 0.7464 12.3684 51.1861 2.0339 50.1160 236.9978 0.0337 0.0713 0.2437 0.1835 6.4916 12.6409 0.2181 0.3442 0.0025 0.0838 0.1938 10.9393 0.9267 12.2709 12.8010 0.2477 0.1468 31.8039 5.3453 29.4155 27.7688 2.1388 0.0217 0.3410 0.6503 0.7307 20.3398 57.3035 38.5680 11.9830 27.2393 8.3488 24.9901 86.9307 208.0804 27.3898 2.2179 4.5751 0.2751 6.1280 7.0677 172.1030 0.2642 5.2406 2.3857 36.2424 40.5577 2.0432 28.4309 2.5506 2.0587 1.0986 117.8077 69.5818 120.5390 3.2688 13.0226 34.8593 24.6523 5.3078 18.0733
temp: 298.150 k
press: 1.00000 atm
elementType: 8 8 8 6 6 6 6 6 6 6 6 6 6 6 6 6 6 6 6 6 1 1 1 1 1 1 1 1 1 1 1 1 1 1 1 1 1 1 1 1 1 1 1 1 1 1
symmnumber: 1
zpe: 1036546.1 jmol-1
zpe.correction: 0.394800 hartree
zpe.thermalcorrener: 0.416537 hartree
zpe.thermalcorrenthalpy: 0.417481 hartree
zpe.thermalcorrgfe: 0.338133 hartree
zpe.sumelectzpe: -887.523190 hartree
zpe.sumelectthermal: -887.501453 hartree
zpe.sumelectthermalent: -887.500509 hartree
zpe.sumelectthermalfe: -887.579857 hartree
dipole: 0.9575 -0.3135 0.3230
dipole: 1.0580
quadrupole: -128.5249 -124.7297 -123.8883
quadrupole: -16.6510 1.4852 1.8455
quadrupole: -2.8106 0.9846 1.8260 -16.6510 1.4852 1.8455
hfenergy: -887.9179899 hartree
pointgroup: C01 [X(C17H26O3)]
dipole: 0.3775763 -0.1031767 0.1416344 debye
polarizability: 283.4456732|-3.5227519|178.4974436|-0.7380536|-8.0114633|121.7742802 unknown
InChI: InChI=1S/C17H26O3/c18-17(19)14-10-5-3-1-2-4-6-11-15-20-16-12-8-7-9-13-16/h7-9,12-13,18H,1-6,10-11,14-15H2
charge 0 multiplicity 1
46 atoms
O  -4.83386 -0.747559 0.062829
O  10.280507 -0.562399 0.080129
O  9.24123 1.407175 -0.573964
C  1.435042 0.229633 -0.134242
C  2.731416 -0.58212 0.084869
C  0.151632 -0.605185 0.072445
C  4.016568 0.238165 -0.165118
C  -1.14625 0.218649 -0.085367
C  5.311974 -0.565757 0.085712
C  -2.420338 -0.645887 0.052734
C  6.591101 0.256004 -0.184402
C  -3.699483 0.190533 -0.022755
C  7.871738 -0.558123 0.07908
C  9.143735 0.224391 -0.18104
C  -6.133055 -0.215932 0.028801
C  -6.433018 1.166376 -0.072643
C  -7.17977 -1.169725 0.105666
C  -7.785854 1.580777 -0.094436
C  -8.520739 -0.740406 0.082078
C  -8.834306 0.638409 -0.017648
H  1.425659 1.097197 0.558686
H  1.435607 0.652408 -1.16076
H  2.743749 -0.977182 1.122398
H  2.726671 -1.468173 -0.584348
H  0.141765 -1.446538 -0.651564
H  0.1705 -1.06507 1.082433
H  4.011654 1.136536 0.48698
H  4.014398 0.613348 -1.209767
H  -1.157411 1.027432 0.675331
H  -1.142946 0.720696 -1.075461
H  5.317664 -0.929046 1.135046
H  5.309588 -1.471391 -0.55701
H  -2.406373 -1.191157 1.016041
H  -2.447229 -1.409687 -0.747865
H  6.593318 0.615689 -1.231248
H  6.596352 1.163636 0.449372
H  -3.752419 0.752933 -0.979153
H  -3.749983 0.915476 0.816966
H  7.90172 -1.469618 -0.550329
H  7.906069 -0.920949 1.125407
H  -5.637568 1.914966 -0.133714
H  -6.918056 -2.229669 0.182593
H  11.097357 -0.021807 -0.100003
H  -8.015002 2.649858 -0.172251
H  -9.324438 -1.483013 0.141709
H  -9.878118 0.968908 -0.035117
