program: Gaussian 09
title: 000081553
version: EM64L-G09RevD.01
frameworkgroup: C1[X(C7H14S)]
method: RPBEPBE
basis: SDD
operation: Freq
keyword: #pfreq=noraman
keyword: PBEPBE/SDD
title: #p freq=noraman PBEPBE/SDD
converged: YES YES NO NO
title: Mulliken charges:
elementType: S C C C C C C C H H H H H H H H H H H H H H
charge: 0.155294 -0.449374 -0.338142 -0.367000 -0.394166 -0.395268 -0.382452 -0.840765 0.241157 0.210575 0.205229 0.217107 0.206163 0.201213 0.190497 0.193168 0.201992 0.200279 0.191382 0.250053 0.250235 0.252823
chargesum: 0.00000
title: Mulliken charges with hydrogens summed into heavy atoms:
elementType: S C C C C C C C
charge: 0.155294 -0.208216 0.077661 0.056270 -0.002456 -0.000108 0.009209 -0.087653
polarizability: 1.13695586e+02 3.20548597e+00 8.43763463e+01 6.59653853e-02 3.06296873e+00 7.13645090e+01
1716.lowfreq: -24.7931 -3.4001 0.0009 0.0015 0.0017 10.0892 45.2083 104.3682 138.9261
frequency: 45.1047 104.1496 138.9003 172.8127 212.2699 268.6654 302.9860 333.6599 418.5320 425.2796 486.6342 662.7060 708.0868 783.4294 810.2996 844.9361 880.3703 886.0501 913.5294 959.9996 972.9811 992.5688 1044.4605 1050.0246 1077.8546 1108.7825 1122.0866 1183.5630 1203.4931 1251.4204 1255.4181 1261.8339 1299.3295 1323.6119 1329.3930 1334.3415 1337.4882 1341.7937 1350.9792 1448.1808 1458.0824 1461.3759 1462.8258 1464.9951 1468.9186 1476.5011 2966.2324 2968.1992 2968.9274 2975.3488 2980.6963 2989.9498 3000.3100 3028.7718 3029.6415 3038.4216 3044.3159 3053.1361 3111.7904 3125.9281
redmass: 2.6104 2.0986 1.2763 3.1076 1.7762 3.5867 2.5891 3.0743 2.1918 3.0826 1.6276 6.8884 2.8701 1.4421 3.2770 1.6037 2.1684 1.7424 1.6368 1.1859 1.3133 2.1762 1.8363 1.1505 1.3251 2.6881 1.8656 1.4646 1.3584 1.2902 1.2709 1.2653 1.2577 1.3957 1.3787 1.4143 1.3821 1.2433 1.4219 1.0565 1.0809 1.0869 1.0874 1.0597 1.0830 1.0938 1.0619 1.0603 1.0658 1.0640 1.0644 1.0780 1.0303 1.0963 1.0971 1.1014 1.1025 1.1026 1.1051 1.1023
irintensity: 1.7975 0.6188 0.9304 0.5488 0.0999 0.4043 1.0414 1.0295 0.7013 0.1189 1.5059 0.8284 8.3398 0.2022 4.1661 2.8515 1.9484 13.0023 0.8213 5.1372 16.5921 13.5415 0.6581 0.1234 0.2113 0.0991 0.4639 2.0672 8.8449 1.5957 7.4029 0.0318 0.9442 5.3531 3.0668 0.0289 0.7672 2.2211 2.3888 17.1235 0.2190 4.7817 9.4651 16.7582 25.4373 3.0038 35.6871 37.2821 34.7969 9.6886 11.0108 33.4269 34.8261 69.5880 73.3593 24.6404 15.0515 112.7579 25.9429 13.0733
temp: 298.150 k
press: 1.00000 atm
elementType: 16 6 6 6 6 6 6 6 1 1 1 1 1 1 1 1 1 1 1 1 1 1
symmnumber: 1
zpe: 512733.7 jmol-1
zpe.correction: 0.195290 hartree
zpe.thermalcorrener: 0.204643 hartree
zpe.thermalcorrenthalpy: 0.205587 hartree
zpe.thermalcorrgfe: 0.160541 hartree
zpe.sumelectzpe: -672.541120 hartree
zpe.sumelectthermal: -672.531767 hartree
zpe.sumelectthermalent: -672.530823 hartree
zpe.sumelectthermalfe: -672.575869 hartree
dipole: -1.0062 1.3455 1.0023
dipole: 1.9563
quadrupole: -57.2282 -58.9510 -58.6967
quadrupole: 4.0091 2.2934 0.1438
quadrupole: 1.0638 -0.6590 -0.4048 4.0091 2.2934 0.1438
hfenergy: -672.7364095 hartree
pointgroup: C01 [X(C7H14S1)]
dipole: -0.3658229 0.5353766 0.4146828 debye
dipolederiv: -0.3690578 0.0244824 -0.0317937 0.0487549 -0.1347543 0.1019038 0.0025677 0.0682952 -0.1395169 0.5100049 -0.0898235 -0.0480188 -0.1175763 0.0663764 -0.0570462 -0.0653881 -0.0390323 0.1482354 -0.1185177 0.0585532 0.0180399 0.0053334 0.0064558 0.0421715 0.0966908 -0.0217748 0.093193 -0.1075679 -0.034265 0.0018988 0.1162454 0.057593 -0.0174155 0.0963482 0.0348101 0.1285152 0.061603 -0.0144291 0.0106664 0.0610042 0.0517017 -0.017705 -0.0570981 0.0398718 0.1650619 0.0758436 0.0176103 0.0136213 -0.0689109 0.0580488 0.0288079 -0.0501079 -0.002454 0.1616182 0.0652435 -0.0075268 -0.0217051 0.0013352 0.0328768 0.0167576 0.0321311 0.0068514 0.1486313 0.0055042 0.0757537 0.0715923 0.0774663 0.0687892 -0.0164477 0.0795316 -0.0104774 0.0699011 -0.0404557 0.0018999 0.0130606 0.0258836 0.0137554 -0.0357622 0.0126268 -0.0143876 -0.1693726 0.0629033 0.0247668 -0.0051236 0.0201583 0.0591189 -0.0527235 -0.0025993 0.0088892 -0.144363 -0.061776 -0.1455926 -0.0166418 -0.1190858 -0.0779584 -0.0215655 -0.0375343 -0.0373483 0.0601119 0.0385238 0.089424 -0.0255551 0.0540532 -0.1293513 0.0739627 -0.0276992 0.0861881 0.0419416 0.0525608 -0.002142 0.0137698 -0.0170483 0.0773933 0.0012289 -0.0034776 -0.0570079 -0.1512525 -0.0274294 0.0791593 -0.0179847 0.0874486 -0.1763523 0.0750548 -0.0315568 0.106822 0.043756 0.0271192 -0.0242564 -0.0178292 -0.0263739 0.0689465 -0.0092941 0.0153496 -0.0801396 -0.1910725 0.0497332 0.027648 -0.0278591 0.0419216 0.0531354 -0.037614 0.0292498 0.0184919 -0.1965446 -0.1161474 -0.1313851 -0.0176883 -0.1293642 -0.1100617 -0.0214455 -0.0408765 -0.0477397 0.0705927 -0.2190128 0.059035 0.0610204 0.0661564 0.0270534 -0.0113935 0.0972572 -0.0190457 0.0542015 0.0839733 -0.0129417 0.0079646 -0.02218 0.0184233 -0.0242207 -0.069793 -0.007659 -0.1926779 -0.1405087 0.0188044 0.0169194 0.0180577 0.0889133 -0.0161109 0.0127129 -0.0219137 0.1138468 0.0787257 -0.0319772 0.0460819 -0.0695486 0.0434081 -0.0418207 -0.0319666 -0.0424549 -0.1561623 0.0887347 0.0172024 -0.044436 -0.0537308 -0.1635113 0.0406777 -0.0563685 0.0312152 0.0413558 unknown
polarizability: 113.9406452|1.7759238|83.9267131|-0.0968527|3.4384416|71.569083 unknown
InChI: InChI=1S/C7H14S/c1-8-7-5-3-2-4-6-7/h7H,2-6H2,1H3
charge 0 multiplicity 1
22 atoms
S  2.223746 -0.75853 -0.440084
C  0.506661 -0.228387 0.207165
C  0.045232 1.113771 -0.395371
C  -0.488601 -1.362879 -0.118316
C  -1.379092 1.480646 0.097493
C  -1.915834 -0.998708 0.366096
C  -2.388593 0.3524 -0.221518
C  3.297974 0.542457 0.396874
H  0.613145 -0.1350 1.30662
H  0.046737 1.022873 -1.499858
H  0.755821 1.921094 -0.13472
H  -0.150371 -2.307095 0.348159
H  -0.502697 -1.525974 -1.215465
H  -1.702124 2.431714 -0.368135
H  -1.356634 1.651909 1.193938
H  -1.920395 -0.936619 1.474049
H  -2.618902 -1.807543 0.088419
H  -3.390384 0.610534 0.17311
H  -2.490897 0.256145 -1.322195
H  4.343253 0.25584 0.201301
H  3.116107 0.5414 1.484367
H  3.108748 1.543354 -0.021828
