program: Gaussian 09
title: 000078690
version: EM64L-G09RevD.01
frameworkgroup: C1[X(C9H9NO6)]
method: RPBEPBE
basis: SDD
operation: Freq
keyword: #pfreq=noraman
keyword: PBEPBE/SDD
title: #p freq=noraman PBEPBE/SDD
converged: YES YES NO NO
title: Mulliken charges:
elementType: O O O O O O N C C C C C C C C C H H H H H H H H H
charge: -0.283825 -0.292602 -0.406587 -0.220482 -0.195257 -0.188719 0.018631 0.261314 0.324018 0.222304 0.259187 -0.498213 -0.500680 0.105098 -0.529315 -0.529569 0.293236 0.302641 0.234595 0.260189 0.241444 0.234763 0.254123 0.242147 0.391558
chargesum: 0.00000
title: Mulliken charges with hydrogens summed into heavy atoms:
elementType: O O O O O O N C C C C C C C C C
charge: -0.283825 -0.292602 -0.015029 -0.220482 -0.195257 -0.188719 0.018631 0.261314 0.324018 0.222304 0.259187 -0.204976 -0.198039 0.105098 0.206912 0.201465
polarizability: 1.92666591e+02 3.06332626e+00 1.39984119e+02 2.70737939e+00 -9.59095705e+00 7.67258750e+01
1716.lowfreq: -8.9689 -0.0004 0.0005 0.0007 1.7002 4.6585 29.3665 56.2825 61.4648
frequency: 29.3656 56.2778 61.4439 93.4157 117.0262 127.6113 141.8323 154.7895 164.7310 176.2879 186.5785 220.3069 256.0848 308.4148 314.4744 345.1135 384.3608 402.5834 415.0016 492.2675 543.1170 569.7762 592.7780 630.0189 637.8414 686.9067 712.0566 720.2602 743.8597 757.7997 772.2536 889.5238 909.5921 923.2105 946.3409 995.1087 1057.9078 1112.9847 1114.9008 1124.3948 1137.4769 1153.6144 1165.9889 1213.1707 1232.6886 1247.5997 1306.1895 1364.0274 1373.8566 1389.9506 1428.3441 1443.4242 1458.1786 1460.9871 1474.2503 1482.5038 1487.8678 1554.3714 1607.5131 1648.4236 2984.0430 2987.7733 3082.2590 3087.7907 3135.1017 3137.9273 3173.4853 3186.0498 3527.0347
redmass: 13.1742 5.2722 3.5382 11.7500 3.4061 2.9294 1.2378 1.1857 3.1662 4.8117 7.4295 4.6331 6.9201 9.0873 7.3166 5.3075 6.5172 8.0136 5.8676 3.8255 1.8964 5.2172 3.8578 4.2720 4.8370 6.1002 7.2282 6.8625 5.3930 4.4866 7.1778 8.6364 1.5975 1.4431 7.1982 8.3647 2.8173 1.2574 1.2424 2.1254 1.5978 1.3983 2.2940 5.1903 1.4199 3.3809 3.7994 5.0264 9.4775 6.9776 1.2155 1.3310 1.0569 1.0735 1.0666 3.1314 1.0589 9.6966 7.3217 9.8316 1.0303 1.0306 1.1050 1.1045 1.1031 1.1036 1.0925 1.0925 1.0643
irintensity: 1.1477 0.7503 1.4250 1.7265 2.2424 11.2104 0.2885 0.6505 1.1497 1.5558 3.0818 8.0989 17.3979 4.5731 2.0252 4.1801 1.3109 2.4369 5.9613 5.6965 41.2292 58.5181 59.4476 33.3090 9.8872 4.2547 15.4134 41.0133 17.2990 11.3178 11.2959 38.7925 1.4147 45.7893 132.8178 47.5106 184.9466 28.6596 8.0902 47.0997 18.3772 3.4978 52.4692 212.1842 27.5222 235.2398 204.3546 115.5902 66.3295 62.6329 2.6168 9.8011 19.7292 7.0130 16.1696 93.4062 13.8642 59.8334 38.0049 254.1445 59.5719 62.3371 24.5533 19.1187 16.6824 15.1432 1.1555 4.8222 49.2122
temp: 298.150 k
press: 1.00000 atm
elementType: 8 8 8 8 8 8 7 6 6 6 6 6 6 6 6 6 1 1 1 1 1 1 1 1 1
symmnumber: 1
zpe: 459488.6 jmol-1
zpe.correction: 0.175010 hartree
zpe.thermalcorrener: 0.190878 hartree
zpe.thermalcorrenthalpy: 0.191822 hartree
zpe.thermalcorrgfe: 0.130867 hartree
zpe.sumelectzpe: -853.144627 hartree
zpe.sumelectthermal: -853.128759 hartree
zpe.sumelectthermalent: -853.127815 hartree
zpe.sumelectthermalfe: -853.188770 hartree
dipole: -5.8848 -1.4262 -1.0426
dipole: 6.1442
quadrupole: -80.2578 -98.9314 -93.6159
quadrupole: -7.1020 -5.5950 11.4835
quadrupole: 10.6772 -7.9964 -2.6809 -7.1020 -5.5950 11.4835
hfenergy: -853.319637 hartree
pointgroup: C01 [X(C9H9N1O6)]
dipole: 2.3236441 0.5981647 -0.2938036 debye
dipolederiv: -1.5289377 -0.5585942 0.180663 -0.3899971 -0.531662 0.1093733 -0.0406811 -0.0052975 -0.365618 -1.399054 0.4405109 -0.2214088 0.3437576 -0.5040988 0.1204207 -0.0733633 0.0649495 -0.3907652 -0.7288331 -0.0013994 -0.4648866 0.0537295 -0.4025429 0.0186898 -0.5399979 0.1129171 -0.8186717 -0.6158563 0.2713267 0.0799624 0.2601172 -0.6875678 -0.36037 -0.0446027 -0.1876277 -0.7153462 -0.4532398 -0.1422079 0.0157545 -0.2143813 -0.7184184 -0.3114855 0.0098699 -0.2622494 -0.4387706 -0.8127816 -0.0539001 0.2212183 -0.049743 -0.3931306 -0.1183639 0.2294472 -0.1394977 -0.4074461 1.4276175 0.5214167 -0.2222421 0.5519504 1.006473 0.4993061 -0.1630031 0.4051882 0.6502898 -0.27318 0.2818744 0.0034915 0.3873665 0.037233 -0.0026171 0.2065156 0.0153091 -0.0326433 -0.4040537 -0.4392528 -0.0364256 -0.4281948 -0.0703366 -0.0788661 -0.1665047 0.0264989 0.0124375 1.0884043 0.5439845 -0.0441754 0.7289577 0.3713074 -0.0468611 0.27883 0.0722371 -0.0087574 0.9895192 -0.5286294 0.0759342 -0.7552566 0.1450988 -0.0873666 -0.2799287 -0.0251286 -0.042117 -0.3532178 -0.24786 0.0149894 0.06296 0.0005602 0.0541129 0.2004714 0.1020662 -0.0877702 -0.0926221 0.3383912 0.0216417 -0.0323399 -0.0560083 0.0359582 -0.182709 0.0369286 -0.0845062 1.3881646 -0.5617979 0.3311895 -0.5533455 0.8932291 0.4523072 0.3666169 0.1965734 1.2219147 0.7208467 0.2562398 -0.1601315 -0.033695 0.1993905 -0.0872952 -0.3513005 -0.2251641 0.4025162 0.6092357 -0.1834867 0.1694766 0.0118092 0.2248502 -0.0868319 0.3837029 -0.2272758 0.432668 0.1027941 0.0087577 -0.0026675 -0.0058631 0.0286693 -0.0237967 -0.0222257 -0.0264146 0.1498005 0.1154552 -0.0126045 -0.0016392 0.0100663 0.0654958 -0.0137046 0.0456959 -0.0145299 0.1655356 -0.012067 0.0527861 -0.0773133 0.0188728 0.0274667 0.0981952 0.0948006 0.1534072 -0.0764013 0.0614205 0.0186915 0.0296935 0.1191385 -0.0210481 -0.0756424 0.0622395 -0.0119707 0.0457194 -0.0729915 -0.1103523 -0.0198532 -0.1201039 0.0559176 -0.0190958 -0.0471032 -0.0385067 0.0574814 0.0047081 -0.0770713 0.0788737 -0.0276587 0.0152587 0.1011154 -0.0761145 0.1352929 -0.0647003 0.0771907 -0.0095831 -0.0296073 -0.1033511 -0.0443592 -0.0887955 -0.061683 -0.0181791 0.0287082 -0.0868925 0.108218 0.0132857 0.1142989 0.0662346 -0.0106202 0.0397149 -0.0262304 0.0620878 0.2483705 0.084542 0.0441765 0.0509055 0.2919877 -0.0777664 0.1313126 -0.113296 0.3043542 unknown
polarizability: 192.7455611|2.7910857|136.1129151|-0.4591355|17.9371787|80.5181094 unknown
InChI: InChI=1S/C9H9NO6/c1-15-7-3-5(9(11)12)6(10(13)14)4-8(7)16-2/h3-4,11H,1-2H3
charge 0 multiplicity 1
25 atoms
O  2.626229 1.524939 0.378508
O  2.716778 -1.324771 -0.371655
O  -3.07873 1.323481 -0.836793
O  -2.502172 2.318918 1.186648
O  -2.121751 -2.527204 -1.076031
O  -3.153055 -1.15895 0.434634
N  -2.149237 -1.492073 -0.30491
C  -0.989477 0.704915 0.155621
C  -0.924752 -0.662387 -0.220085
C  1.472253 0.761114 0.161539
C  1.511692 -0.623757 -0.194876
C  0.224858 1.394272 0.354702
C  0.306007 -1.320095 -0.402798
C  -2.254329 1.502581 0.273565
C  3.582508 1.607208 -0.757645
C  3.56309 -1.442658 0.845212
H  0.214342 2.451938 0.633078
H  0.330658 -2.380023 -0.668041
H  3.116124 2.163974 -1.590544
H  3.887122 0.603272 -1.099693
H  4.443634 2.166742 -0.364994
H  3.037992 -2.047503 1.606736
H  3.809984 -0.448668 1.258782
H  4.47324 -1.962404 0.512682
H  -3.930407 1.821539 -0.707444
