program: Gaussian 09
title: 000081547
version: EM64L-G09RevD.01
frameworkgroup: C1[X(C12H8N4)]
method: RPBEPBE
basis: SDD
operation: Freq
keyword: #pfreq=noraman
keyword: PBEPBE/SDD
title: #p freq=noraman PBEPBE/SDD
converged: NO NO NO NO
title: Mulliken charges:
elementType: N N N N C C C C C C C C C C C C H H H H H H H H
charge: -0.189586 -0.190455 -0.085639 -0.085810 0.321758 0.321296 0.010260 0.010740 -0.323738 -0.323172 -0.301890 -0.300941 -0.198102 -0.198627 -0.209293 -0.211368 0.263152 0.262732 0.252552 0.252147 0.231286 0.231580 0.230242 0.230876
chargesum: 0.00000
title: Mulliken charges with hydrogens summed into heavy atoms:
elementType: N N N N C C C C C C C C C C C C
charge: -0.189586 -0.190455 -0.085639 -0.085810 0.321758 0.321296 0.010260 0.010740 -0.060586 -0.060440 -0.049337 -0.048794 0.033184 0.032952 0.020949 0.019508
polarizability: 3.21922481e+02 4.10709987e+00 1.55649149e+02 -1.36080092e-05 2.26725724e-03 5.86343916e+01
1716.lowfreq: -10.8163 -6.6988 0.0005 0.0006 0.0009 10.9012 69.8308 128.4057 159.0361
frequency: 69.8189 128.3843 159.0343 202.8671 240.4947 315.2285 318.2609 364.1914 418.3905 422.8586 443.5686 549.4536 553.2152 559.9411 567.0113 594.3651 614.9675 634.9507 679.7829 735.7024 738.5701 753.2962 756.6301 772.0646 796.0377 853.3086 854.8872 856.4957 916.9181 943.9712 945.5687 980.4792 980.6520 990.9688 1000.9348 1002.4832 1066.9941 1067.3335 1129.8163 1132.6870 1161.9406 1169.9328 1236.2967 1246.8152 1293.1023 1297.6641 1328.6945 1381.7987 1408.1984 1423.6533 1442.8600 1459.6176 1475.3389 1500.4394 1559.8946 1586.8666 1619.8209 1629.3634 3137.8402 3140.3482 3155.3879 3155.5798 3169.2999 3173.3214 3179.0129 3180.4236
redmass: 5.8774 3.9124 5.1277 5.3216 5.9268 6.3300 6.2949 6.7114 5.6173 2.9730 3.3757 4.5217 7.9140 7.9809 4.0087 8.0495 6.3341 7.9463 6.1418 4.2770 4.7387 1.2733 1.3168 11.8206 5.7084 1.4008 1.3962 6.7361 8.3439 1.3507 1.3506 1.3003 1.3011 5.2578 2.2076 2.4511 6.0874 5.6376 1.4428 1.5302 1.1801 1.1474 2.9208 3.2101 1.5616 1.6478 9.2074 2.4373 2.2123 5.4885 4.8691 4.6291 3.5707 4.5319 6.4824 7.3603 7.9318 8.2996 1.0865 1.0861 1.0897 1.0903 1.0960 1.0957 1.1003 1.0997
irintensity: 2.1141 0.7267 3.2184 0.0001 0.0002 0.0000 1.5291 5.5143 0.0000 0.0073 18.6583 0.0003 5.4217 0.0003 0.0417 0.0002 4.0603 0.6294 0.0000 8.3053 0.0605 0.0576 200.8993 0.0014 16.2354 0.3644 0.4046 0.0011 2.7159 1.2391 3.4318 0.0081 0.0023 0.0434 10.2706 3.4295 46.4000 15.3142 0.3571 23.5130 5.8901 0.0009 50.7802 0.1444 6.1157 0.0674 33.6057 0.2638 69.6680 0.0863 53.8740 0.7497 48.6823 0.0010 0.0399 3.6850 55.6493 3.4887 8.0084 5.8253 7.0798 7.6799 8.9279 7.2086 24.7465 15.3182
temp: 298.150 k
press: 1.00000 atm
elementType: 7 7 7 7 6 6 6 6 6 6 6 6 6 6 6 6 1 1 1 1 1 1 1 1
symmnumber: 1
zpe: 464307.2 jmol-1
zpe.correction: 0.176845 hartree
zpe.thermalcorrener: 0.187480 hartree
zpe.thermalcorrenthalpy: 0.188424 hartree
zpe.thermalcorrgfe: 0.140460 hartree
zpe.sumelectzpe: -679.939807 hartree
zpe.sumelectthermal: -679.929172 hartree
zpe.sumelectthermalent: -679.928228 hartree
zpe.sumelectthermalfe: -679.976192 hartree
dipole: -0.0005 -0.0031 -0.0001
dipole: 0.0032
quadrupole: -68.8417 -89.5112 -97.3574
quadrupole: -2.6069 -0.0002 0.0001
quadrupole: 16.3951 -4.2744 -12.1207 -2.6069 -0.0002 0.0001
hfenergy: -680.1166521 hartree
pointgroup: C01 [X(C12H8N4)]
dipole: 0.0002016 0.0012366 -0.0000285 debye
dipolederiv: 0.5714092 0.4288825 -0.0000138 0.3929363 0.1748205 0.0000251 0.0000014 0.0000681 0.069094 0.5615146 0.4269308 -0.0000145 0.3931748 0.1694125 -0.0000359 -0.0000248 -0.000074 0.0682903 -0.7932914 -0.1051796 -0.0000117 -0.2020145 -0.3670194 -0.0000224 0.0000272 0.0000341 -0.1676983 -0.7960092 -0.1091599 0.0000208 -0.2049591 -0.3687056 0.0000378 -0.0000135 -0.0000211 -0.1681505 -0.3057931 -0.2930959 -0.0000148 0.262276 -0.0891758 -0.0000131 -0.0000041 -0.0000038 0.021719 -0.3008742 -0.2928893 0.0000232 0.2599315 -0.0896021 0.0000166 -0.0000066 0.0000067 0.0229641 0.4597524 -0.0828251 -0.0000033 -0.35878 0.0576333 0.0000087 0.0000258 0.0000054 0.0273244 0.459351 -0.0808106 0.000009 -0.3579983 0.0562956 -0.0000083 -0.0000048 -0.0000114 0.0273199 0.3943686 0.0481141 0.0000016 -0.2457373 0.0350341 -0.00001 -0.0000012 -0.000007 -0.1350662 0.3905896 0.0476697 0.000001 -0.2444843 0.0368457 0.0000038 0.000012 0.0000042 -0.1354945 0.047256 0.1027996 -0.0000042 0.0626291 0.0873802 -0.0000059 -0.0000082 -0.0000135 -0.1627784 0.0468265 0.1014185 0.0000027 0.0648895 0.0893835 -0.0000051 0.0000074 0.0000009 -0.1621509 -0.3811339 -0.1288247 0.0000014 -0.2383305 0.0018393 -0.0000126 0.0000217 -0.0000028 -0.1825517 -0.3794971 -0.1281754 0.0000091 -0.2363399 0.0039545 0.0000012 -0.0000058 -0.000007 -0.18218 0.0214075 0.0553145 -0.0000091 0.3344902 0.0865425 -0.000011 -0.0000255 -0.0000132 -0.1475927 0.0190911 0.0561296 0.0000096 0.3328109 0.0853064 0.0000017 0.0000102 0.0000051 -0.1481024 0.0868161 -0.0519476 0.0000034 0.0098449 -0.0186134 0.0000127 0. 0.0000091 0.1797242 0.0865563 -0.0521061 -0.0000026 0.0101358 -0.0201283 -0.0000047 -0.0000029 -0.0000021 0.179324 0.0830982 -0.0011847 0.0000018 -0.0593983 -0.0443525 0.0000087 0.0000045 0.0000083 0.1697275 0.0831943 -0.0011369 -0.0000029 -0.0600869 -0.0459346 0.0000008 -0.000006 0.0000026 0.1692113 -0.0485225 0.0974622 -0.0000015 0.1017762 0.0052977 0.0000076 -0.000002 0.0000059 0.1676042 -0.0473121 0.097044 -0.0000055 0.1024479 0.00483 0.0000013 -0.0000065 0.0000022 0.1675976 -0.1305046 -0.0672956 0.0000083 -0.0591143 0.0745679 0.0000053 0.0000105 0.0000055 0.1607571 -0.1282933 -0.0671342 -0.000008 -0.0600998 0.0743878 -0.0000023 -0.0000089 -0.0000024 0.1611081 unknown
polarizability: 321.9878933|2.4469612|155.5837364|-0.000009|-0.0022673|58.6343916 unknown
InChI: InChI=1S/C12H8N4/c1-3-7-11-9(5-1)13-16-12-8-4-2-6-10(12)14-15(11)16/h1-8H
charge 0 multiplicity 1
24 atoms
N  -0.251673 0.681645 -0.000041
N  0.26403 -0.649516 -0.000006
N  -0.703869 -1.622017 0.000124
N  0.71669 1.651342 0.00003
C  -1.636013 0.562832 0.000048
C  1.647219 -0.531201 0.000046
C  -1.884359 -0.865454 0.000115
C  1.896989 0.894836 0.000054
C  -2.667567 1.525284 0.000003
C  2.679739 -1.491016 0.000059
C  -3.230083 -1.331269 0.000158
C  3.240244 1.358878 0.000095
C  -3.985336 1.03439 0.000062
C  3.997888 -1.002928 0.00011
C  -4.255666 -0.373866 0.000138
C  4.269048 0.40496 0.00013
H  -2.443899 2.595658 -0.000067
H  2.456871 -2.561938 0.000033
H  -3.44178 -2.404288 0.000203
H  3.451539 2.432542 0.000093
H  -4.822041 1.740555 0.000039
H  4.832226 -1.71147 0.000133
H  -5.298568 -0.71018 0.000176
H  5.310471 0.744523 0.000165
