program: Gaussian 09
title: 000081548
version: EM64L-G09RevD.01
frameworkgroup: C1[X(C12H9N4)]
method: RPBEPBE
basis: SDD
operation: Freq
keyword: #p
keyword: freq=noraman
keyword: PBEPBE/SDD
title: #p freq=noraman PBEPBE/SDD
converged: NO YES NO NO
title: Mulliken charges:
elementType: N N N N C C C C C C C C C C C C H H H H H H H H H
charge: -0.116934 -0.193776 -0.370049 -0.012558 0.335166 0.398021 0.283047 0.022476 -0.298447 -0.320908 -0.309541 -0.269503 -0.176299 -0.176510 -0.162598 -0.192549 0.374542 0.293660 0.264324 0.272693 0.286306 0.268720 0.267623 0.264696 0.268395
chargesum: 1.00000
title: Mulliken charges with hydrogens summed into heavy atoms:
elementType: N N N N C C C C C C C C C C C C
charge: -0.116934 -0.193776 0.004493 -0.012558 0.335166 0.398021 0.283047 0.022476 -0.004786 -0.056584 -0.036847 0.016803 0.092421 0.091113 0.102098 0.075846
polarizability: 3.06931672e+02 2.69482218e+00 1.51904914e+02 1.32076029e-02 -4.40407305e-02 5.61403034e+01
1716.lowfreq: -47.3075 -6.9546 -0.0008 -0.0007 -0.0006 3.7319 8.9114 73.6298 123.4006
frequency: -47.1708 73.6279 123.4003 158.6487 198.3417 242.4134 301.1176 314.0436 338.3517 416.1534 418.3549 436.4212 525.3997 550.2418 551.2074 563.0504 588.0927 610.3399 633.1360 680.6187 720.0150 731.5463 761.4698 765.3729 788.5258 806.1080 858.0351 858.3011 865.8673 916.5553 960.3468 961.2610 1001.1480 1001.8117 1002.9841 1010.0010 1054.4943 1058.5913 1102.0515 1138.5900 1151.4814 1181.3438 1185.8429 1238.2099 1248.3543 1285.5664 1306.8397 1344.8169 1358.7057 1405.0996 1417.2603 1440.0631 1449.3880 1458.0628 1488.4568 1507.4556 1575.8727 1608.3769 1617.3740 1626.6324 3163.3658 3165.9399 3173.9575 3177.7705 3185.3746 3187.6232 3196.5333 3198.6207 3602.7197
redmass: 1.5809 4.2667 3.9051 5.0119 4.5286 5.5409 4.2419 6.0372 3.9023 5.3872 3.0665 3.3624 4.3216 5.9922 4.1816 7.5880 7.4579 5.5787 7.2907 6.1749 4.7543 4.3668 1.2982 1.2506 6.4385 6.8674 2.9166 1.8028 1.3607 7.3052 1.3566 1.3486 2.1981 1.3412 1.3416 2.2000 5.5469 4.3744 3.6598 1.5532 1.6649 1.2079 1.1778 2.4866 3.0258 1.4792 1.6064 2.8683 2.4061 2.5581 3.6356 2.4839 5.6345 3.8128 3.1446 4.7393 6.6411 6.9932 7.8977 8.2213 1.0881 1.0885 1.0914 1.0917 1.0972 1.0972 1.1001 1.1004 1.0836
irintensity: 104.8334 36.3800 0.0237 0.5736 4.7153 1.0137 7.0890 0.4354 3.8298 0.5624 0.0911 22.3051 1.9269 6.9156 2.0771 0.3185 0.2085 0.5766 0.8224 0.1909 0.2425 10.7020 59.3538 157.7483 14.7507 11.6288 0.7054 0.5291 0.0163 3.0197 1.6534 2.0273 1.6886 0.0276 0.0015 2.4940 4.9498 2.7881 7.4139 5.1817 4.5773 11.3150 3.3667 1.6847 0.9049 11.0434 5.2954 56.7657 0.1756 3.7180 50.9548 17.2223 14.2109 8.1327 11.7922 27.6095 4.3717 24.8896 27.3310 5.9943 1.1685 0.8270 1.0293 1.1696 0.4994 0.4216 1.5003 1.6329 173.3570
temp: 298.150 k
press: 1.00000 atm
elementType: 7 7 7 7 6 6 6 6 6 6 6 6 6 6 6 6 1 1 1 1 1 1 1 1 1
symmnumber: 1
zpe: 496648.5 jmol-1
zpe.correction: 0.189163 hartree
zpe.thermalcorrener: 0.199868 hartree
zpe.thermalcorrenthalpy: 0.200812 hartree
zpe.thermalcorrgfe: 0.152693 hartree
zpe.sumelectzpe: -680.291034 hartree
zpe.sumelectthermal: -680.280330 hartree
zpe.sumelectthermalent: -680.279386 hartree
zpe.sumelectthermalfe: -680.327505 hartree
dipole: 0.6454 3.8503 0.2034
dipole: 3.9093
quadrupole: -30.6306 -65.9955 -95.1817
quadrupole: -0.2700 0.1370 0.6200
quadrupole: 33.3053 -2.0596 -31.2457 -0.2700 0.1370 0.6200
hfenergy: -680.4801979 hartree
pointgroup: C01 [X(C12H9N4)]
dipole: 0.2653023 1.5127626 0.0821209 debye
dipolederiv: 0.5253361 0.389863 -0.002964 0.3230731 0.0329065 -0.0195493 0.0024642 -0.026281 0.0937997 0.2767219 0.3745415 -0.0063177 0.3045036 0.4537102 0.0002897 0.0004151 -0.0003828 0.1174567 -0.5910974 0.0928847 -0.0225692 -0.23699 -0.5620487 0.0395442 0.0087643 0.0889545 -0.2413115 -0.1608355 -0.2068944 0.0032453 -0.201594 -0.2547961 0.0027616 -0.0035043 -0.0015479 -0.1158238 -0.2259883 -0.264865 0.0000377 -0.098116 -0.0332402 -0.0009313 -0.0035914 -0.0060528 0.0133604 -0.0721333 -0.1875647 0.0093011 -0.3869115 -0.0724503 0.0003795 0.0045039 0.0065383 0.0821945 0.4958646 -0.3138819 0.0129022 -0.0143525 0.1461721 -0.0168279 -0.0102382 -0.0186937 0.0899901 0.1142146 0.0118811 -0.0008893 0.29743 -0.0152564 0.0003006 0.0010612 0.0001796 0.0503519 0.2963421 0.0957342 -0.0004561 -0.2245159 0.051247 0.0011188 0.0003416 0.0019402 -0.0908308 -0.0260748 -0.0564504 -0.0019872 -0.1173837 0.0541972 -0.0004498 -0.001627 -0.0031194 -0.152505 -0.073005 0.2120817 -0.0029284 0.1169037 0.0635259 -0.0002289 0.0021615 -0.0018511 -0.1465492 0.1439957 0.0185425 0.0001744 0.0921632 0.1328221 -0.0004659 0.0021651 -0.0003173 -0.1077923 -0.2792401 -0.1829389 -0.0001661 -0.4220366 -0.0385371 0.0026901 0.0014919 0.0019641 -0.118048 0.0730665 0.0038677 0.0012123 0.360101 0.1458376 -0.0026235 -0.000646 0.0010872 -0.0828076 -0.1215661 -0.0566635 0.0022015 -0.2637258 0.1603022 -0.0002251 0.0003145 -0.00185 -0.0930244 0.0666395 0.1222762 0.0005173 0.4218219 -0.0789695 -0.0004138 -0.0003496 0.0005352 -0.1045432 0.1284491 -0.0146208 0.0088424 0.0600513 0.4029758 -0.0040501 -0.0007425 -0.0411665 0.4072783 0.1011042 -0.0481527 0.0002548 -0.0244677 0.0723699 -0.0004681 -0.0021382 -0.0004641 0.1827635 0.0774966 -0.0627467 -0.0002663 -0.0042195 0.0058073 -0.0003158 0.0003259 0.0010791 0.1910609 0.1058814 0.0191536 0.0000448 -0.0146836 0.0017332 -0.000449 -0.000266 0.0003312 0.1863642 0.1056227 0.0193171 -0.0002454 -0.0131638 0.0424193 0.0001195 -0.0009785 0.0000539 0.175257 0.0302668 0.0550086 0.0005566 0.045793 0.050229 -0.0004917 0.0008264 -0.0011194 0.1689783 -0.0060212 -0.0386442 0.0004446 -0.0226287 0.0969979 -0.0001241 -0.0003767 -0.0006287 0.163606 0.0302296 0.0633444 -0.000583 0.0505492 0.051791 0.0004792 -0.0001827 0.000669 0.1637139 -0.0152698 -0.0450731 -0.0003622 -0.0276007 0.090254 -0.0000688 -0.0001945 0.0001424 0.1670604 unknown
polarizability: 306.9632024|1.5356027|151.8732035|-0.1571884|0.0981999|56.1404835 unknown
InChI: InChI=1S/C12H9N4/c1-3-7-11-9(5-1)13-16-12-8-4-2-6-10(12)14-15(11)16/h1-8,13H
charge 1 multiplicity 1
25 atoms
N  -0.295386 0.691918 0.017441
N  0.248728 -0.611794 0.014107
N  0.743109 1.605293 -0.003101
N  -0.690345 -1.576552 0.008632
C  1.652296 -0.513192 0.00483
C  -1.674288 0.577441 0.01224
C  1.955422 0.885333 0.004768
C  -1.89425 -0.859997 0.010612
C  2.645578 -1.507529 0.000048
C  -2.732256 1.512721 0.007104
C  3.289693 1.332791 0.003574
C  -3.218304 -1.372188 0.007212
C  3.979099 -1.053869 -0.0018
C  4.290551 0.337846 0.000955
C  -4.028259 0.971705 0.003174
C  -4.267342 -0.443875 0.004033
H  0.569627 2.60271 0.115004
H  2.389367 -2.569374 -0.002212
H  -2.56821 2.593267 0.003631
H  3.546782 2.395008 0.001733
H  -3.392538 -2.450829 0.007356
H  4.792943 -1.783833 -0.006091
H  5.340084 0.646576 -0.000473
H  -4.885465 1.651519 -0.002124
H  -5.301036 -0.800997 0.001647
