program: Gaussian 09
title: 000081555
version: EM64L-G09RevD.01
frameworkgroup: C1[X(C10H13NO2)]
method: RPBEPBE
basis: SDD
operation: Freq
keyword: #p
keyword: freq=noraman
keyword: PBEPBE/SDD
title: #p freq=noraman PBEPBE/SDD
converged: YES YES NO NO
title: Mulliken charges:
elementType: O O N C C C C C C C C C C H H H H H H H H H H H H H
charge: -0.206121 -0.205277 0.010223 -0.544160 -0.355709 0.443152 -0.344962 0.167174 -0.376334 -0.696930 -0.354329 -0.232710 -0.222239 0.241371 0.203851 0.233525 0.195210 0.208959 0.188964 0.245066 0.217205 0.208012 0.217596 0.280213 0.236341 0.241910
chargesum: 0.00000
title: Mulliken charges with hydrogens summed into heavy atoms:
elementType: O O N C C C C C C C C C C
charge: -0.206121 -0.205277 0.010223 -0.098938 0.073026 0.443152 0.052961 0.167174 -0.131268 -0.054118 -0.074116 0.003631 0.019671
polarizability: 1.59348104e+02 5.49339176e+00 1.39708187e+02 1.21264602e+01 -1.17285912e+00 7.45441630e+01
1716.lowfreq: -11.5786 -4.8555 -0.0007 -0.0006 0.0004 5.1857 35.4160 48.9353 66.4742
frequency: 35.1235 48.9297 66.4712 78.9457 129.6647 148.6037 217.0419 227.2324 246.1909 268.8613 350.6482 379.4448 394.0586 425.4258 523.4410 529.8550 588.4484 648.6527 672.7167 732.7221 737.5192 765.7367 783.3854 791.6442 829.2345 879.6073 903.7053 921.1243 971.0320 998.3954 1005.5934 1033.1187 1060.4882 1067.2472 1086.2503 1103.3443 1147.7854 1176.3571 1203.7074 1209.6094 1214.8605 1254.5198 1265.2494 1289.5521 1295.8280 1315.4892 1345.0458 1361.8371 1387.7595 1388.6468 1433.9660 1465.3193 1470.0351 1471.7630 1475.9151 1480.5141 1487.9120 1578.1026 1609.4785 2964.9041 2973.6185 2976.9055 2990.7936 3013.8694 3048.1995 3069.2327 3073.4398 3076.8281 3130.5629 3148.2657 3164.9654 3184.3735
redmass: 5.4551 4.6734 1.9077 3.2835 3.4381 2.9995 3.1288 1.1716 4.4649 6.0671 3.7849 2.9724 4.8325 3.5426 3.5144 5.1480 5.0378 6.8793 5.2571 1.2150 2.5167 5.9462 1.5026 1.2235 4.9282 1.4756 1.6997 1.2551 1.3852 1.3666 4.1391 2.6029 2.3534 2.6466 1.9045 2.1551 1.5865 1.0858 2.5438 1.6481 5.0196 1.3174 1.3273 1.0852 1.3384 1.3345 1.5666 5.8035 1.2854 4.8210 2.3513 1.1044 1.5800 1.4339 1.0458 1.0822 1.0897 6.3824 6.7288 1.0591 1.0377 1.0622 1.0651 1.0962 1.0968 1.0999 1.0993 1.1011 1.0874 1.0910 1.0954 1.0975
irintensity: 0.4142 1.0001 0.3331 0.2917 0.6500 1.1807 0.1860 0.0227 1.1494 0.9593 0.6427 0.0968 1.1985 0.2504 9.2607 0.8921 2.6253 8.1216 17.1926 8.2725 21.1464 8.3147 44.4618 12.0215 5.4314 2.1258 3.1293 0.2861 3.5172 0.4716 3.0389 2.5207 10.5008 6.4430 4.4471 23.6590 6.0282 6.3378 54.2676 35.4827 140.7262 5.4169 2.6067 3.9330 7.1897 1.5851 6.5652 132.9338 13.2985 5.5782 8.8407 0.9664 24.8129 14.3533 11.9923 6.5079 20.0953 15.6461 16.4299 26.3138 28.6538 39.6222 34.8248 10.7949 7.0222 25.6069 47.5206 71.5656 4.5099 12.8541 13.5567 7.7000
temp: 298.150 k
press: 1.00000 atm
elementType: 8 8 7 6 6 6 6 6 6 6 6 6 6 1 1 1 1 1 1 1 1 1 1 1 1 1
symmnumber: 1
zpe: 555038.0 jmol-1
zpe.correction: 0.211403 hartree
zpe.thermalcorrener: 0.224139 hartree
zpe.thermalcorrenthalpy: 0.225083 hartree
zpe.thermalcorrgfe: 0.170898 hartree
zpe.sumelectzpe: -593.006437 hartree
zpe.sumelectthermal: -592.993701 hartree
zpe.sumelectthermalent: -592.992757 hartree
zpe.sumelectthermalfe: -593.046942 hartree
dipole: -0.2804 -4.7961 -0.0086
dipole: 4.8043
quadrupole: -71.5084 -82.6911 -77.9718
quadrupole: 5.8037 4.0478 -0.8871
quadrupole: 5.8820 -5.3006 -0.5814 5.8037 4.0478 -0.8871
hfenergy: -593.2178402 hartree
pointgroup: C01 [X(C10H13N1O2)]
dipole: -0.246671 1.8734869 0.0442667 debye
dipolederiv: -0.6236763 -0.21852 -0.0470434 -0.2590447 -0.8225124 -0.0438791 -0.0319034 -0.0114552 -0.229172 -0.8231164 0.0959903 -0.0366638 0.1519444 -0.5456488 -0.0092589 -0.0299027 -0.0493176 -0.2035749 1.2049809 -0.0419331 0.1266167 0.002136 1.5766017 0.0897012 0.0668509 0.079818 0.162903 -0.2912933 -0.0279872 -0.0244566 0.04897 0.162495 -0.0419552 -0.1818703 -0.0619784 0.1002964 0.043902 0.0018571 0.0163413 0.020761 0.1405844 0.013118 0.2292611 0.0449572 0.0355221 0.4092415 0.1689794 -0.0799446 -0.2335779 0.1326851 0.0405422 -0.1599347 -0.0021214 -0.0006664 0.0774884 0.0100395 -0.023655 -0.0099959 0.1641267 -0.0287718 -0.1530568 -0.0364845 0.0991533 -0.0828384 0.1989511 -0.0389803 0.0859292 -0.5194843 -0.0313578 0.0233509 -0.025768 0.0365106 -0.2818607 0.1231586 -0.0105372 0.3063316 0.003153 -0.0848139 0.0289184 -0.0566785 -0.1414803 -0.0900073 -0.0093988 -0.0602249 0.0076109 0.0932935 0.000511 0.0076631 0.0044848 0.0255965 -0.049007 -0.2558422 -0.0188786 0.0658846 0.1083189 -0.0197464 0.0112006 0.0106801 -0.088088 0.1325057 0.0114105 -0.057783 -0.0184891 0.1982231 -0.0107243 -0.0870685 -0.0289196 -0.0845808 0.0714757 -0.054415 -0.0943454 -0.1131953 -0.2985649 0.0244449 -0.0703937 0.0182712 -0.1329767 0.0653527 0.0130915 0.0176288 0.0165461 -0.0423455 -0.1022156 0.003983 -0.048957 0.0280885 0.0264705 -0.0137382 0.0284734 -0.0471422 -0.0584729 0.1411696 0.0334881 0.0793377 -0.0281799 0.0654514 -0.018776 0.0291517 0.0061497 -0.007625 0.110969 0.0610505 0.0796947 -0.0341825 0.017118 0.031147 0.0028967 0.0132425 -0.106146 -0.1244758 0.0098746 -0.087374 -0.0046002 0.039536 -0.0091387 -0.012513 0.0319476 -0.1062579 -0.1288478 0.0036376 -0.1012696 -0.0072779 0.0151702 -0.0055026 -0.0012472 -0.044575 -0.051069 0.1539206 0.0374692 0.1230596 -0.0906533 0.0298919 -0.1002198 0.057497 -0.0719739 -0.0113037 0.0304454 0.0592187 0.042868 0.1118974 0.0941621 -0.0521767 0.0366478 -0.0162336 -0.041779 0.1368043 -0.0134653 0.1093901 -0.0522646 0.091695 0.0474371 0.009468 -0.0096948 -0.1243124 -0.1271082 -0.0315383 -0.0948384 0.0119255 -0.2338459 0.0169139 0.0476889 0.0233308 0.0974934 -0.0102624 0.0642923 -0.0131409 0.0512014 0.0890772 -0.0189038 0.0334021 -0.0629349 0.0580719 0.0326626 0.014937 0.0288163 0.1556009 0.0708448 0.065888 0.0231876 0.0789548 -0.0777284 -0.007068 0.0223287 -0.0016459 0.1452569 -0.0687185 0.0416882 0.0772732 0.0271181 0.0782034 -0.0038035 0.0816088 -0.0014287 0.1337451 unknown
polarizability: 160.3289436|-3.7337654|139.0806342|-11.0139237|-0.575263|74.1908762 unknown
InChI: InChI=1S/C10H13NO2/c1-2-3-6-9-7-4-5-8-10(9)11(12)13/h4-5,7-8H,2-3,6H2,1H3
charge 0 multiplicity 1
26 atoms
O  -1.682196 -2.811358 -0.164901
O  0.499724 -2.186219 -0.020145
N  -0.761506 -1.907334 -0.080459
C  1.109976 0.435556 -0.903163
C  2.148085 0.515124 0.253683
C  -0.321135 0.579822 -0.41189
C  3.598634 0.379268 -0.260056
C  -1.189962 -0.484873 -0.030469
C  -0.870093 1.888313 -0.317818
C  4.640472 0.491193 0.873542
C  -2.51875 -0.266048 0.410918
C  -2.181318 2.129133 0.139302
C  -3.014479 1.045104 0.506763
H  1.260346 -0.5192 -1.434297
H  1.317341 1.256332 -1.617408
H  1.936715 -0.291334 0.9802
H  2.030235 1.479529 0.788855
H  3.709797 -0.597363 -0.772267
H  3.795065 1.159811 -1.024175
H  -0.239275 2.732543 -0.619377
H  4.483675 -0.296739 1.633747
H  4.56906 1.470004 1.384466
H  5.670465 0.386306 0.486069
H  -3.134989 -1.131512 0.668139
H  -2.556418 3.156355 0.202047
H  -4.035671 1.220788 0.858992
