program: Gaussian 09
title: 000078679
version: EM64L-G09RevD.01
frameworkgroup: C1[X(C11H24N2O3)]
method: RPBEPBE
basis: SDD
operation: Freq
keyword: #p
keyword: freq=noraman
keyword: PBEPBE/SDD
title: #p freq=noraman PBEPBE/SDD
converged: YES YES NO NO
title: Mulliken charges:
elementType: O O O N N C C C C C C C C C C C H H H H H H H H H H H H H H H H H H H H H H H H
charge: -0.271774 -0.271774 -0.298979 -0.400058 -0.400050 -0.368645 -0.368630 -0.347135 -0.347147 -0.247802 -0.247811 -0.685489 -0.685484 -0.240598 -0.240620 0.324782 0.202777 0.212683 0.202779 0.212679 0.194213 0.190133 0.190138 0.194208 0.191025 0.177153 0.177150 0.191034 0.213167 0.210313 0.215289 0.210313 0.213167 0.215287 0.196311 0.245036 0.245020 0.196320 0.300512 0.300508
chargesum: 0.00000
title: Mulliken charges with hydrogens summed into heavy atoms:
elementType: O O O N N C C C C C C C C C C C
charge: -0.271774 -0.271774 -0.298979 -0.099547 -0.099542 0.046815 0.046829 0.037211 0.037198 0.120376 0.120373 -0.046720 -0.046717 0.200749 0.200720 0.324782
polarizability: 1.89213922e+02 -3.35200500e-03 1.41278712e+02 6.96827436e-04 1.06090317e+00 1.24142225e+02
1716.lowfreq: -0.0007 -0.0006 0.0010 2.9370 6.9002 8.3793 13.8648 21.7507 36.9551
frequency: 13.2817 21.7434 36.9537 38.6658 48.7010 52.8718 76.8741 80.5841 106.4858 113.1020 114.6080 123.6363 138.2737 139.4768 226.1219 233.1593 233.2613 236.7725 250.7075 257.4336 281.4356 353.5749 382.8581 412.6353 443.8817 452.1813 542.1055 571.3579 619.9967 668.4427 720.6407 742.2067 742.2477 808.7688 808.9607 872.6715 882.5047 894.8843 922.4703 930.6398 938.6992 939.4075 992.8470 1002.2544 1042.4115 1046.4851 1059.4872 1085.8556 1087.6343 1093.5819 1103.8872 1122.9568 1128.9942 1149.9229 1150.6238 1211.7957 1212.0528 1224.1450 1227.8571 1243.1798 1243.8412 1272.2599 1272.3137 1275.5529 1275.6025 1285.0335 1285.0858 1341.5987 1342.3579 1358.6881 1359.9807 1388.0200 1388.1526 1405.8846 1410.0466 1459.1471 1461.6806 1470.8430 1470.8618 1474.6159 1475.1261 1477.5498 1477.5627 1480.9631 1484.8588 1486.5550 1492.6797 1493.9553 1508.3633 1658.1089 2905.4440 2905.6776 2941.7362 2942.8500 2955.8277 2955.9494 2965.7607 2965.7965 2974.5481 2974.5942 2992.5542 2992.6484 3009.2990 3009.3045 3030.2433 3030.8173 3055.5175 3055.5868 3073.0527 3073.1361 3073.9376 3074.0080 3548.3200 3555.8135
redmass: 3.9695 3.7599 1.9744 1.9385 3.8533 2.9674 3.2138 3.6125 3.7014 2.0402 1.9251 2.7689 4.4781 4.2376 3.9960 1.1167 1.1453 2.3654 2.6083 3.4475 3.2234 3.7072 1.6246 3.3854 3.1460 2.7101 4.5135 1.6274 2.4091 3.9024 11.2906 1.0736 1.0735 1.1321 1.1312 3.6727 2.8830 2.1435 2.7544 2.9461 1.1525 1.1774 7.8784 7.2562 3.7152 3.9972 1.7496 2.3021 2.1815 1.9036 3.0934 2.6426 2.8894 1.4725 1.4937 1.3562 1.3627 3.1997 1.4158 1.4198 1.1492 1.2791 1.2841 1.1792 1.1815 1.0767 1.0767 1.3016 1.3248 1.4346 1.4304 1.2109 1.2100 1.3683 1.3655 1.1256 1.0843 1.0737 1.0697 1.0914 1.0661 1.0440 1.0428 1.3184 1.0773 1.1427 1.1068 1.1085 2.0028 5.1783 1.0561 1.0562 1.0632 1.0636 1.1035 1.1035 1.0587 1.0587 1.0363 1.0363 1.0596 1.0596 1.1003 1.1003 1.0997 1.0997 1.1037 1.1037 1.1011 1.1010 1.0996 1.0996 1.0775 1.0765
irintensity: 0.2059 1.1734 0.3602 2.9748 5.3468 0.8504 0.3121 5.7470 0.9474 1.1080 1.3327 0.0214 15.3003 2.7680 1.2291 0.0505 0.3468 4.6595 2.2910 1.7319 0.7412 28.2248 6.4883 0.2254 25.7844 1.6931 28.0655 185.9254 86.0145 0.1028 19.1254 4.6576 13.6073 0.4339 0.0247 26.5697 0.1805 5.1253 42.8095 95.5749 0.3175 2.4350 348.9171 106.6928 148.4303 61.6541 0.2595 16.0559 2.3996 0.9655 8.5079 2.9948 16.6302 0.0290 4.1622 0.2288 0.0494 10.6978 111.0831 340.0305 8.3635 0.6565 8.4819 0.0040 0.0033 0.0033 0.1842 6.6525 6.8922 20.9019 29.3259 16.3737 0.0745 2.3591 0.1157 25.4642 6.7695 0.6916 1.5016 1.8287 0.1124 21.2976 7.4686 25.3688 33.7548 20.4920 4.8972 9.5262 600.9276 167.0234 90.3170 31.4817 83.6571 131.2317 11.1497 77.9160 22.8890 58.7055 14.0380 50.0862 17.8824 64.4964 2.6219 12.3927 1.2886 19.6765 11.1948 30.5256 18.0086 177.8718 109.7548 4.4391 5.0128 19.8957
temp: 298.150 k
press: 1.00000 atm
elementType: 8 8 8 7 7 6 6 6 6 6 6 6 6 6 6 6 1 1 1 1 1 1 1 1 1 1 1 1 1 1 1 1 1 1 1 1 1 1 1 1
symmnumber: 1
zpe: 915149.0 jmol-1
zpe.correction: 0.348562 hartree
zpe.thermalcorrener: 0.369386 hartree
zpe.thermalcorrenthalpy: 0.370331 hartree
zpe.thermalcorrgfe: 0.294166 hartree
zpe.sumelectzpe: -767.402621 hartree
zpe.sumelectthermal: -767.381797 hartree
zpe.sumelectthermalent: -767.380853 hartree
zpe.sumelectthermalfe: -767.457017 hartree
dipole: -0.0007 -1.3066 -2.2280
dipole: 2.5829
quadrupole: -78.0926 -95.9475 -99.3284
quadrupole: -0.0001 -0.0020 8.7060
quadrupole: 13.0302 -4.8247 -8.2056 -0.0001 -0.0020 8.7060
hfenergy: -767.7511833 hartree
pointgroup: C01 [X(C11H24N2O3)]
dipole: 0.0002061 0.5064416 -0.8809937 debye
polarizability: 189.2139061|-0.0215171|141.25908|-0.0209499|-1.2090039|124.1618732 unknown
InChI: InChI=1S/C11H24N2O3/c1-3-5-7-15-9-12-11(14)13-10-16-8-6-4-2/h12-13H,3-10H2,1-2H3
charge 0 multiplicity 1
40 atoms
O  2.916811 0.542197 -0.433713
O  -2.915697 0.544589 -0.432249
O  0.001322 1.889552 1.372623
N  1.177635 2.136687 -0.642699
N  -1.175497 2.137865 -0.642245
C  4.567362 -1.226212 -0.259284
C  -4.566865 -1.223027 -0.256382
C  5.901228 -1.715759 0.350893
C  -5.900687 -1.711887 0.354456
C  4.19774 0.187845 0.198565
C  -4.1964 0.190987 0.200915
C  6.270823 -3.142826 -0.108512
C  -6.270904 -3.139011 -0.10427
C  2.466623 1.894902 -0.048819
C  -2.464466 1.897111 -0.047903
C  0.001159 2.022854 0.114746
H  4.630103 -1.239135 -1.364779
H  3.747347 -1.914033 0.022889
H  -4.630069 -1.236192 -1.361848
H  -3.747024 -1.91113 0.025611
H  5.832268 -1.69077 1.457619
H  6.715418 -1.015621 0.072167
H  -6.71474 -1.011587 0.075739
H  -5.831341 -1.6865 1.46115
H  4.095573 0.227568 1.306658
H  4.987903 0.916075 -0.09974
H  -4.986437 0.919472 -0.097098
H  -4.093533 0.230947 1.308932
H  5.488734 -3.867635 0.185644
H  6.374209 -3.189981 -1.208909
H  7.226281 -3.475968 0.336541
H  -6.374624 -3.186568 -1.204619
H  -5.488973 -3.863964 0.189947
H  -7.226346 -3.471649 0.341196
H  3.210776 2.637538 -0.410569
H  2.350244 1.974147 1.049397
H  -2.347737 1.976592 1.05026
H  -3.208201 2.640146 -0.409674
H  1.127457 2.148067 -1.662487
H  -1.125674 2.149313 -1.66205
