program: Gaussian 09
title: 000081568
version: EM64L-G09RevD.01
frameworkgroup: C1[X(C14H12O2)]
method: RPBEPBE
basis: SDD
operation: Freq
keyword: #pfreq=noraman
keyword: PBEPBE/SDD
title: #p freq=noraman PBEPBE/SDD
converged: YES YES NO NO
title: Mulliken charges:
elementType: O O C C C C C C C C C C C C C C H H H H H H H H H H H H
charge: -0.439802 -0.224457 0.358102 0.267563 0.083896 -0.370609 -0.401909 0.436871 -0.390939 -0.379631 -0.395233 -0.333402 -0.229423 -0.233483 -0.808953 0.062216 0.235481 0.241121 0.255799 0.228212 0.227722 0.275222 0.232654 0.235966 0.223497 0.224066 0.238442 0.381011
chargesum: 0.00000
title: Mulliken charges with hydrogens summed into heavy atoms:
elementType: O O C C C C C C C C C C C C C C
charge: -0.058790 -0.224457 0.358102 0.267563 0.083896 -0.135128 -0.160788 0.436871 -0.135139 -0.151419 -0.167511 -0.058180 0.003231 0.002483 -0.122949 0.062216
polarizability: 2.35479320e+02 -1.28850822e+01 1.56885463e+02 8.95065944e+00 1.11097893e+01 9.08437200e+01
1716.lowfreq: -14.1149 -10.4203 -0.0005 0.0003 0.0005 4.6938 17.7767 36.9800 48.3643
frequency: 17.3482 36.8290 48.2335 60.2913 93.7564 136.2640 162.1384 219.1546 267.9876 275.6182 334.5577 353.6350 398.4201 406.8731 419.8743 498.7338 527.7964 553.4277 566.1138 590.8637 602.3939 636.7906 672.2515 696.5799 723.0739 756.1546 766.7329 788.9438 802.1768 824.4516 845.3305 893.0318 949.6270 969.0533 971.2406 985.6783 986.8990 995.9287 999.0769 1021.0416 1046.2396 1051.2336 1113.3017 1125.4786 1158.3992 1177.7260 1194.6625 1224.5311 1261.0047 1288.5027 1300.7106 1307.7780 1355.6088 1372.6349 1395.8342 1407.3507 1427.1098 1469.9067 1471.6899 1473.7387 1513.8823 1566.3262 1579.2372 1602.5683 1623.7388 1645.9064 2974.1875 3055.2629 3083.4352 3116.7446 3118.6456 3130.7199 3139.6362 3145.6547 3146.9735 3160.6915 3180.2769 3522.6573
redmass: 1.0335 6.5459 4.6519 4.4614 4.4402 4.7831 5.0931 4.5804 6.9489 3.9919 4.4001 3.3298 4.4275 2.9559 3.5638 3.9291 3.9723 3.3000 4.8431 1.4184 3.3533 6.5525 4.6270 4.3028 3.0506 3.8320 2.1318 2.2694 5.3677 1.5089 1.2482 1.4135 1.3170 1.3909 1.4710 1.5006 3.7748 6.1795 1.3537 2.7824 1.5642 2.2212 1.6936 1.3456 1.7806 1.0650 1.1030 2.9403 1.7366 2.3390 2.3244 1.3285 4.1244 9.9202 1.2243 3.4506 2.2075 1.2744 1.1214 1.7015 3.0267 6.0702 6.6588 6.2420 6.4603 8.7548 1.0383 1.0952 1.0998 1.0872 1.0874 1.0860 1.0960 1.0947 1.0937 1.0967 1.0970 1.0641
irintensity: 0.4604 1.1921 0.2854 1.5885 0.0061 1.4365 0.2861 0.3959 1.1621 0.9002 3.8186 4.0392 1.1069 0.7895 10.3721 6.7875 15.7781 24.0494 0.6179 83.2520 42.7611 0.1219 12.0054 47.0558 5.0756 24.6011 50.6914 20.0934 0.7833 38.6247 0.8127 0.1829 0.9769 4.8114 31.4535 23.1186 209.2084 24.8965 1.1565 2.5305 20.3132 15.3011 30.6759 33.9099 76.6826 0.3917 3.5415 1.3424 5.3518 13.8527 54.5533 2.1716 0.5888 4.3566 9.8036 2.6411 4.0745 22.9033 15.4308 54.4200 4.4356 13.6022 9.4210 8.3839 12.0009 247.9622 40.1316 23.4216 18.7631 7.0421 26.3729 3.1241 33.2201 6.1822 9.6715 19.9893 10.9998 37.4908
temp: 298.150 k
press: 1.00000 atm
elementType: 8 8 6 6 6 6 6 6 6 6 6 6 6 6 6 6 1 1 1 1 1 1 1 1 1 1 1 1
symmnumber: 1
zpe: 572917.7 jmol-1
zpe.correction: 0.218213 hartree
zpe.thermalcorrener: 0.232337 hartree
zpe.thermalcorrenthalpy: 0.233281 hartree
zpe.thermalcorrgfe: 0.174866 hartree
zpe.sumelectzpe: -690.036745 hartree
zpe.sumelectthermal: -690.022621 hartree
zpe.sumelectthermalent: -690.021676 hartree
zpe.sumelectthermalfe: -690.080091 hartree
dipole: 0.4401 -1.0008 0.6966
dipole: 1.2964
quadrupole: -77.6062 -82.1781 -95.9399
quadrupole: -0.0834 -0.8334 4.3990
quadrupole: 7.6352 3.0633 -10.6985 -0.0834 -0.8334 4.3990
hfenergy: -690.2549577 hartree
pointgroup: C01 [X(C14H12O2)]
dipole: -0.1947432 0.4460722 0.152396 debye
polarizability: 236.628786|-10.4664613|143.7348364|-6.4722246|-27.5902705|102.8448797 unknown
InChI: InChI=1S/C14H12O2/c1-10-6-8-11(9-7-10)12-4-2-3-5-13(12)14(15)16/h2-9,15H,1H3
charge 0 multiplicity 1
28 atoms
O  -2.30963 -2.714097 0.972349
O  -0.339159 -2.468646 -0.220383
C  0.621672 0.384292 -0.092143
C  -0.863548 0.539898 -0.136695
C  -1.794758 -0.511177 0.150565
C  1.27081 -0.188888 1.032552
C  1.429574 0.890411 -1.143175
C  3.486693 0.223939 0.036972
C  -1.389752 1.831972 -0.40905
C  2.675624 -0.263909 1.095071
C  2.836513 0.805132 -1.08095
C  -3.188048 -0.232606 0.210362
C  -2.775201 2.09356 -0.37994
C  -3.681769 1.059507 -0.051923
C  4.999521 0.102938 0.090943
C  -1.364305 -1.936429 0.264188
H  0.671252 -0.560826 1.871248
H  0.951135 1.327375 -2.027699
H  -0.687112 2.647822 -0.609924
H  3.152588 -0.704882 1.978944
H  3.43773 1.190965 -1.913373
H  -3.872764 -1.052138 0.443612
H  -3.143062 3.103575 -0.592252
H  -4.758159 1.255783 -0.009401
H  5.491887 0.893109 -0.502935
H  5.374722 0.168751 1.127636
H  5.332934 -0.871293 -0.31704
H  -1.997387 -3.658937 0.961741
