program: Gaussian 09
title: 000081559
version: EM64L-G09RevD.01
frameworkgroup: C1[X(C11H13NO3)]
method: RPBEPBE
basis: SDD
operation: Freq
keyword: #p
keyword: freq=noraman
keyword: PBEPBE/SDD
title: #p freq=noraman PBEPBE/SDD
converged: YES YES NO NO
title: Mulliken charges:
elementType: O O O N C C C C C C C C C C C H H H H H H H H H H H H H
charge: -0.211072 -0.216696 -0.250798 -0.352341 -0.504035 0.487222 -0.366771 -0.438222 -0.221182 -0.216579 -0.239953 0.125880 -0.227447 0.141456 -0.665815 0.262763 0.233354 0.244618 0.231623 0.343069 0.228169 0.227937 0.230682 0.234245 0.234128 0.211494 0.236786 0.237485
chargesum: 0.00000
title: Mulliken charges with hydrogens summed into heavy atoms:
elementType: O O O N C C C C C C C C C C C
charge: -0.211072 -0.216696 -0.250798 -0.009272 -0.007918 0.487222 -0.122153 -0.206599 0.006987 0.011358 -0.009270 0.125880 0.240926 0.141456 0.019950
polarizability: 1.90126595e+02 2.63972083e+00 1.14311270e+02 1.94035218e+01 -7.06741850e+00 9.82184767e+01
1716.lowfreq: -4.6154 -2.5473 -0.0004 0.0007 0.0008 8.6792 14.4944 25.6315 35.0139
frequency: 13.5890 25.5880 34.9374 47.4101 69.6261 104.9904 125.5590 184.5980 203.8751 238.1208 248.2020 278.1769 307.1361 365.4287 402.8437 413.4691 481.5823 498.8666 517.3394 590.9869 617.0538 701.8216 715.1570 728.5352 757.7963 771.0227 798.1772 802.0101 815.5567 854.0161 868.2234 916.6959 977.6597 990.2268 991.3119 997.9950 1016.7097 1026.7298 1050.0966 1087.5416 1114.9095 1133.4626 1173.0856 1182.2011 1188.1820 1210.9680 1223.6139 1243.1345 1250.0901 1318.2868 1352.4830 1355.8277 1387.1163 1404.0177 1442.1432 1462.0539 1470.8738 1471.2484 1484.7610 1485.8792 1488.7500 1596.0245 1597.0127 1615.6407 1635.0066 2985.5698 2999.8689 3012.1930 3042.3669 3073.1635 3096.3788 3113.8255 3115.9638 3124.7108 3136.3035 3147.7013 3164.7707 3504.1167
redmass: 4.5469 3.9654 5.7552 3.3562 4.5390 4.0366 2.5403 3.8636 4.2238 2.7434 1.7982 3.4857 4.9051 3.3899 2.8134 3.3262 4.4169 9.2029 6.3877 4.0852 6.3774 1.6805 1.2395 4.1686 1.9884 10.1807 1.1180 4.1384 3.9595 1.2543 4.0405 1.4031 1.3961 5.1098 2.3807 1.4519 2.2286 2.1897 4.3998 1.5640 2.2579 1.4610 1.0549 2.5536 1.2073 2.2681 2.6302 1.4833 1.1362 1.3191 1.3928 1.4312 5.6393 1.2604 2.1395 1.0391 1.1014 1.1493 1.1290 1.8532 1.8544 6.3772 8.9816 6.0652 9.9343 1.0606 1.0362 1.0580 1.1009 1.1071 1.0984 1.1025 1.0876 1.0862 1.0912 1.0961 1.1015 1.0775
irintensity: 0.2500 0.2925 4.5118 0.1828 3.9884 2.3949 0.4478 1.4890 0.2882 1.9049 2.7613 12.2747 23.1297 2.2736 1.1059 9.4512 16.7993 22.9091 12.1629 8.5674 0.5567 71.7538 105.8516 3.7202 57.6271 0.3672 4.6034 3.4649 9.2927 0.2284 6.5529 4.5211 0.4832 1.8128 23.5804 2.4863 67.5121 13.5088 25.0037 28.9052 4.1929 6.5184 0.4734 205.8532 21.3444 39.3317 215.3404 5.9897 0.0459 4.1109 10.3542 0.4872 4.1640 26.4880 20.8534 12.4803 26.4401 19.2487 26.1572 21.5305 157.6761 18.3911 146.6829 9.7636 206.2269 33.7849 18.5257 14.9851 10.8688 8.5044 25.1452 35.9429 9.0462 1.4825 11.7219 39.3763 21.7172 46.5827
temp: 298.150 k
press: 1.00000 atm
elementType: 8 8 8 7 6 6 6 6 6 6 6 6 6 6 6 1 1 1 1 1 1 1 1 1 1 1 1 1
symmnumber: 1
zpe: 582822.8 jmol-1
zpe.correction: 0.221985 hartree
zpe.thermalcorrener: 0.236899 hartree
zpe.thermalcorrenthalpy: 0.237843 hartree
zpe.thermalcorrgfe: 0.176263 hartree
zpe.sumelectzpe: -706.293912 hartree
zpe.sumelectthermal: -706.278998 hartree
zpe.sumelectthermalent: -706.278054 hartree
zpe.sumelectthermalfe: -706.339634 hartree
dipole: 0.1239 1.1589 1.9179
dipole: 2.2443
quadrupole: -64.2611 -83.4554 -96.6535
quadrupole: -5.5229 -1.0484 -8.0848
quadrupole: 17.1956 -1.9987 -15.1968 -5.5229 -1.0484 -8.0848
hfenergy: -706.5158972 hartree
pointgroup: C01 [X(C11H13N1O3)]
dipole: -0.0242696 0.1312878 0.872834 debye
polarizability: 188.2547577|-13.8853772|115.8381728|-18.8371327|-5.5008849|98.563411 unknown
InChI: InChI=1S/C11H13NO3/c1-2-15-11(14)10(13)12-8-9-6-4-3-5-7-9/h3-7,12H,2,8H2,1H3
charge 0 multiplicity 1
28 atoms
O  3.544949 -0.336758 -0.220996
O  1.387869 -0.056974 -1.94841
O  2.276804 0.60522 1.492919
N  0.147123 0.868272 -0.180949
C  -1.094142 1.085708 -0.938657
C  -2.306158 0.419867 -0.294034
C  -2.271739 -0.954363 0.056122
C  -3.491437 1.158641 -0.060534
C  -3.403066 -1.576442 0.626677
C  -4.627272 0.536999 0.50825
C  -4.58563 -0.832532 0.854129
C  1.275931 0.31902 -0.747965
C  4.706556 -0.479102 0.721793
C  2.408194 0.21751 0.301643
C  5.829826 -1.134447 -0.071217
H  -0.905449 0.676938 -1.949582
H  -1.278147 2.172102 -1.050014
H  -1.357848 -1.533445 -0.122126
H  -3.52765 2.223332 -0.324059
H  0.195694 1.116995 0.812845
H  -3.365986 -2.639171 0.891326
H  -5.538379 1.119924 0.683659
H  -5.463581 -1.315699 1.297175
H  4.970079 0.52891 1.089828
H  4.373689 -1.087612 1.581965
H  6.714878 -1.266215 0.577543
H  5.52107 -2.124553 -0.446329
H  6.118822 -0.511326 -0.934101
