program: Gaussian 09
title: 000078916
version: EM64L-G09RevD.01
frameworkgroup: C1[X(C19H17Cl2N5O4)]
method: RPBEPBE
basis: SDD
operation: Freq
keyword: #p
keyword: freq=noraman
keyword: PBEPBE/SDD
title: #p freq=noraman PBEPBE/SDD
converged: YES YES NO NO
title: Mulliken charges:
elementType: Cl Cl O O O O N N N N N C C C C C C C C C C C C C C C C C C C H H H H H H H H H H H H H H H H H
charge: -0.002010 0.002482 -0.259995 -0.261434 -0.208040 -0.208443 -0.154141 -0.051455 -0.110264 -0.009466 0.016497 -0.443221 -0.415121 0.469563 -0.275453 -0.447106 -0.349991 -0.324436 -0.368748 -0.300875 0.126949 -0.154095 0.325637 0.475644 -0.747694 -0.257958 -0.193278 0.439045 -0.406384 -0.398186 0.254083 0.238851 0.238698 0.246836 0.235888 0.239721 0.275749 0.317553 0.259498 0.242923 0.262076 0.282802 0.264415 0.254042 0.252280 0.313835 0.312726
chargesum: 0.00000
title: Mulliken charges with hydrogens summed into heavy atoms:
elementType: Cl Cl O O O O N N N N N C C C C C C C C C C C C C C C C C C C
charge: -0.002010 0.002482 -0.259995 -0.261434 -0.208040 -0.208443 -0.154141 -0.051455 -0.110264 -0.009466 0.016497 0.049713 0.070412 0.469563 0.200156 0.146195 -0.090492 -0.081513 -0.106672 -0.018072 0.126949 -0.154095 0.325637 0.475644 0.023043 -0.257958 -0.193278 0.439045 -0.092550 -0.085459
polarizability: 7.39407965e+02 -7.97940228e-02 2.72113993e+02 -5.52663832e+01 2.18125876e+01 1.80067122e+02
1716.lowfreq: -6.9345 -3.8584 0.0013 0.0019 0.0022 3.0417 10.5355 15.6727 22.4899
frequency: 10.2191 15.5354 22.4427 26.9236 36.7263 46.4693 54.7004 59.9314 69.9790 74.6130 80.0048 89.7987 100.2920 110.4672 120.3903 139.4640 153.7448 159.0100 166.8036 183.7286 207.4701 211.0761 218.2092 232.2867 273.8081 299.1010 313.8160 339.1749 348.5459 352.9532 359.1616 376.9694 386.5976 403.0742 412.9763 431.1331 457.6991 466.3666 481.6412 507.3464 513.4602 525.6323 534.9867 548.5002 565.4887 577.7849 597.0402 603.0905 629.0334 677.7647 696.3497 710.3430 733.7730 745.1361 752.8496 758.5637 777.0398 790.4823 815.7903 842.0521 853.4170 872.8037 875.2906 890.8141 909.5039 919.8752 947.9653 973.0553 981.4062 984.7326 988.4486 1001.2276 1009.8492 1020.1757 1040.9574 1044.7335 1049.4684 1103.8858 1114.5901 1125.6654 1146.0338 1162.0959 1173.9746 1190.3869 1195.1576 1205.5955 1221.4687 1252.2909 1264.8975 1270.3266 1292.8007 1305.7953 1313.2443 1340.7975 1349.9610 1355.4296 1359.9437 1366.9960 1373.2487 1378.4205 1386.3731 1398.4202 1406.0288 1412.3950 1449.6354 1452.3048 1454.1066 1459.5931 1466.5364 1479.0391 1494.4361 1509.4172 1547.8687 1551.3250 1578.9394 1621.5411 1652.2768 2197.7525 2988.6604 2991.7338 3004.8163 3006.7564 3025.3763 3055.2242 3073.9256 3079.8728 3098.8087 3099.4293 3145.3605 3152.0666 3154.1915 3171.3622 3179.8617 3188.9064 3193.9110
redmass: 10.6410 8.5975 12.1086 8.5835 10.7093 4.7520 5.0941 16.3633 6.3754 1.5184 2.4184 6.3263 3.7016 4.9112 10.1222 8.0920 4.7758 8.3803 7.1768 10.6848 5.3168 7.1862 5.4847 4.9761 4.5374 2.8239 6.9555 20.0549 10.8213 5.5882 6.3097 3.6119 5.7181 5.0690 4.2945 3.8764 3.9212 3.0061 4.9470 5.1472 6.0665 2.9732 3.3579 3.3036 3.1153 5.4046 5.4108 4.6981 6.9982 8.3012 7.6814 4.9557 5.0685 5.2583 9.6752 2.7023 1.5131 6.8543 1.3050 1.7011 6.9670 3.2606 5.9481 3.1266 1.3529 1.4645 4.5002 1.3529 2.3819 1.3557 2.8229 2.4665 2.7465 3.3037 2.6512 1.6568 2.1925 2.6024 3.3500 1.6286 2.3479 1.7352 1.5543 3.0578 2.0241 4.6489 1.3969 1.3269 1.2928 3.0424 1.2571 1.2070 1.4108 4.4829 1.5602 1.8227 1.3015 3.5034 5.9896 3.7712 1.2583 2.3649 2.7936 4.8004 1.1094 1.0575 1.0678 2.5382 1.1488 1.2104 1.2032 2.5062 6.3315 9.7298 8.0323 6.3791 8.8376 12.4107 1.0660 1.0663 1.0394 1.0598 1.0582 1.0989 1.0967 1.1001 1.0933 1.1068 1.1023 1.0871 1.0888 1.0959 1.0953 1.0928 1.0933
irintensity: 0.2792 0.3266 0.8321 0.0733 2.4403 1.3844 0.5796 0.0008 1.4724 1.5793 0.2483 3.4385 4.8276 3.1579 1.9099 4.7428 1.0546 3.3756 7.7691 0.9315 0.7021 2.5528 3.7233 1.4085 1.8981 10.7823 2.0929 0.7165 1.8841 5.1776 6.3302 0.5009 1.0807 7.2453 16.3894 0.8875 10.0871 7.4731 4.1887 3.5332 6.9367 14.0750 0.9381 23.8444 3.8870 30.6509 1.5082 6.4316 0.7850 9.9055 10.6342 49.0747 15.4537 24.8208 74.6688 9.2950 15.0656 20.4275 2.5344 73.1524 51.6593 131.8172 100.3393 12.3880 3.1539 42.8444 2.4310 0.1215 46.8129 1.4306 1.4209 27.1460 43.7260 45.9402 90.5026 19.2340 17.7439 46.7633 2.5751 0.7057 867.2625 33.5211 106.8602 219.9267 281.1883 876.7665 37.4959 31.8351 78.4235 8.4072 15.1479 17.6040 38.7937 21.8840 418.2357 545.2769 3.7250 44.5240 181.7557 120.7218 70.6765 68.7647 31.7693 49.5577 21.6492 14.5300 13.6791 2.0836 14.2456 14.7705 18.1923 124.2646 88.4561 41.0277 132.3198 554.6418 180.9359 26.2469 27.1694 80.6700 0.4149 13.1747 62.4213 16.7156 1.7272 24.9155 6.4462 18.6548 4.2538 8.6836 0.5521 15.8393 13.3227 8.6214 11.7376
temp: 298.150 k
press: 1.00000 atm
elementType: 17 17 8 8 8 8 7 7 7 7 7 6 6 6 6 6 6 6 6 6 6 6 6 6 6 6 6 6 6 6 1 1 1 1 1 1 1 1 1 1 1 1 1 1 1 1 1
symmnumber: 1
zpe: 882549.7 jmol-1
zpe.correction: 0.336145 hartree
zpe.thermalcorrener: 0.365498 hartree
zpe.thermalcorrenthalpy: 0.366442 hartree
zpe.thermalcorrgfe: 0.270411 hartree
zpe.sumelectzpe: -2226.685175 hartree
zpe.sumelectthermal: -2226.655822 hartree
zpe.sumelectthermalent: -2226.654878 hartree
zpe.sumelectthermalfe: -2226.750910 hartree
dipole: 9.9406 -5.5980 -0.6890
dipole: 11.4292
quadrupole: -242.4627 -203.1519 -181.2052
quadrupole: -39.2292 -2.7532 -0.0060
quadrupole: -33.5228 5.7880 27.7347 -39.2292 -2.7532 -0.0060
hfenergy: -2227.0213205 hartree
pointgroup: C01 [X(C19H17Cl2N5O4)]
dipole: -3.8320567 -1.5180515 1.7973104 debye
polarizability: 743.7503628|4.657627|192.6015463|-22.0830653|-43.7606415|255.237171 unknown
InChI: InChI=1S/C19H17Cl2N5O4/c1-13(27)30-10-9-25(8-2-7-22)15-5-3-14(4-6-15)23-24-19-17(20)11-16(26(28)29)12-18(19)21/h3-6,11-12H,2,8-10H2,1H3
charge 0 multiplicity 1
47 atoms
Cl 3.401475 0.962399 -2.788508
Cl 3.560634 -0.101575 2.728997
O  -4.840836 -2.626182 0.716334
O  -5.187866 -2.018828 -1.513006
O  8.481171 0.869106 -1.224133
O  8.521422 0.405868 1.01411
N  -4.154885 0.40631 0.854876
N  1.462979 -0.334154 0.539422
N  2.181054 0.544301 -0.119439
N  -6.310837 3.102763 -2.659045
N  7.896504 0.611662 -0.099498
C  -4.97062 -0.388492 1.795053
C  -4.851225 1.46868 0.100842
C  -2.770849 0.230233 0.745255
C  -5.76239 -1.553112 1.170096
C  -4.92527 1.185788 -1.434951
C  -2.11157 -0.909986 1.316296
C  -1.957264 1.20045 0.058443
C  -0.722985 -1.050432 1.224985
C  -0.572283 1.052725 -0.028163
C  0.073686 -0.077805 0.557947
C  -5.684508 2.238493 -2.124816
C  -4.622587 -2.749523 -0.668925
C  3.583116 0.426284 -0.055373
C  -3.624173 -3.844028 -0.952285
C  4.321831 0.709875 -1.248268
C  4.360185 0.207404 1.129004
C  6.42181 0.549186 -0.086839
C  5.717011 0.766794 -1.291837
C  5.759944 0.275566 1.128699
H  -4.328134 -0.771456 2.604955
H  -5.7083 0.285574 2.274806
H  -5.880027 1.544088 0.491682
H  -4.374439 2.452121 0.276172
H  -6.399512 -2.023844 1.93806
H  -6.381392 -1.221635 0.317883
H  -3.90846 1.132988 -1.865727
H  -5.390445 0.199531 -1.617764
H  -2.691757 -1.701405 1.796418
H  -2.41426 2.088584 -0.386276
H  -0.217204 -1.919096 1.659051
H  0.040777 1.799383 -0.542808
H  -2.603009 -3.456675 -0.778303
H  -3.706263 -4.158025 -2.002921
H  -3.777354 -4.701479 -0.278414
H  6.262098 0.968337 -2.216377
H  6.342908 0.11804 2.038991
