program: Gaussian 09
title: 000078707
version: EM64L-G09RevD.01
frameworkgroup: C1[X(C13H14N4O)]
method: RPBEPBE
basis: SDD
operation: Freq
keyword: #p
keyword: freq=noraman
keyword: PBEPBE/SDD
title: #p freq=noraman PBEPBE/SDD
converged: YES YES NO NO
title: Mulliken charges:
elementType: O N N N N C C C C C C C C C C C C C H H H H H H H H H H H H H H
charge: -0.259101 -0.704088 -0.700488 -0.676498 -0.679392 0.369408 0.347061 -0.022981 -0.530196 -0.539632 0.263855 0.270690 -0.408606 -0.391203 0.261051 0.268439 -0.372779 -0.390733 0.258354 0.265175 0.266888 0.265488 0.214710 0.213785 0.298234 0.295512 0.303497 0.294887 0.308440 0.299923 0.310552 0.299748
chargesum: 0.00000
title: Mulliken charges with hydrogens summed into heavy atoms:
elementType: O N N N N C C C C C C C C C C C C C
charge: -0.259101 -0.110342 -0.102105 -0.068134 -0.069092 0.369408 0.347061 -0.022981 -0.271841 -0.274457 0.263855 0.270690 -0.141719 -0.125715 0.261051 0.268439 -0.158069 -0.176948
polarizability: 3.27719823e+02 -4.74415557e+00 1.83132928e+02 1.22279701e+01 2.74036250e+00 9.62307941e+01
1716.lowfreq: 0.0007 0.0008 0.0009 1.3233 4.9744 10.8206 36.5744 47.9100 61.8991
frequency: 36.5646 47.9068 61.8967 103.5062 137.8382 176.2939 201.5781 209.6368 222.9277 234.6696 243.2101 294.4120 296.3785 308.6779 333.1745 355.0425 407.6395 434.4375 439.1164 443.7095 473.4531 483.1470 521.3284 534.7913 538.2780 547.2765 557.7258 565.4819 588.5380 604.8956 619.5211 634.1191 671.1710 718.4230 738.7089 756.7758 765.0989 772.9950 813.9373 825.6377 839.4479 894.8284 901.9415 926.0863 945.9131 951.4192 987.4966 1028.3671 1030.9383 1069.5247 1081.6422 1131.6110 1152.2480 1159.7165 1222.8042 1262.7257 1284.5753 1291.6429 1305.2397 1326.7610 1336.0217 1395.4286 1401.4281 1443.0460 1449.3723 1511.1108 1521.6694 1527.6984 1586.3068 1591.6769 1600.6249 1604.2617 1636.4119 1639.4097 1644.4607 1645.7658 3115.5968 3119.4646 3131.5653 3133.6774 3159.8696 3164.4951 3488.9951 3490.8345 3508.3976 3515.7704 3628.7108 3631.0076 3655.0429 3661.7653
redmass: 5.0613 4.5311 4.6691 6.8946 4.8231 5.0416 2.1007 3.0517 1.7500 1.6342 2.2033 3.3773 3.3118 3.3409 3.9680 8.0699 4.0773 2.3993 2.9180 2.9024 1.2752 1.1456 3.9980 1.6226 1.6642 2.8533 2.7787 3.1408 1.4709 1.6113 3.1094 3.0974 5.6057 3.9499 3.7743 3.5836 4.1187 4.4438 1.4886 1.9638 3.5139 1.4173 1.6046 3.8190 1.3215 1.3758 2.6243 1.6153 1.6382 1.4853 1.3803 1.8494 1.1801 1.2045 2.5119 3.3555 2.4465 1.3858 1.4190 2.9658 4.7277 5.9918 5.9564 4.7407 4.7460 7.6957 3.7709 4.5010 6.7322 6.3122 1.9793 1.8381 1.8191 1.8440 1.1465 1.3103 1.0890 1.0892 1.0908 1.0911 1.0940 1.0945 1.0467 1.0465 1.0459 1.0457 1.0985 1.0987 1.1006 1.1011
irintensity: 3.6399 0.9379 1.6964 2.1976 0.4003 1.1586 1.1458 4.7142 1.1438 6.7388 5.6452 3.5477 7.4457 46.8794 5.9340 5.5926 8.9114 54.6219 33.7871 33.9175 58.6044 24.2721 28.0053 136.5389 376.0711 3.1425 78.8313 63.6645 349.2617 155.5151 54.2328 100.5290 11.3334 34.1093 6.8747 28.8384 40.2143 1.8857 22.7548 35.8029 29.0690 10.0415 30.6506 3.8172 2.1474 1.3504 13.5006 3.0727 2.5936 1.3292 12.1547 7.5009 124.1880 16.9894 137.7839 10.3306 83.4044 7.6520 18.5341 100.5272 632.3712 4.1225 63.0382 1.9976 61.6487 168.4223 51.4547 250.9499 50.7578 113.0932 41.0136 5.5110 415.9867 43.0005 91.6920 66.6626 26.6781 29.1487 6.6425 10.4426 6.6664 6.9022 13.6772 9.7402 55.7342 59.4662 19.0215 16.9131 22.9956 22.0729
temp: 298.150 k
press: 1.00000 atm
elementType: 8 7 7 7 7 6 6 6 6 6 6 6 6 6 6 6 6 6 1 1 1 1 1 1 1 1 1 1 1 1 1 1
symmnumber: 1
zpe: 666647.4 jmol-1
zpe.correction: 0.253913 hartree
zpe.thermalcorrener: 0.270686 hartree
zpe.thermalcorrenthalpy: 0.271631 hartree
zpe.thermalcorrgfe: 0.210213 hartree
zpe.sumelectzpe: -796.754640 hartree
zpe.sumelectthermal: -796.737866 hartree
zpe.sumelectthermalent: -796.736922 hartree
zpe.sumelectthermalfe: -796.798339 hartree
dipole: 0.5233 -5.7288 0.3508
dipole: 5.7633
quadrupole: -52.0198 -98.3887 -109.9564
quadrupole: 1.2189 2.6989 0.4729
quadrupole: 34.7685 -11.6004 -23.1681 1.2189 2.6989 0.4729
hfenergy: -797.0085524 hartree
pointgroup: C01 [X(C13H14N4O1)]
dipole: 0.3691984 -1.9142738 -1.1578853 debye
polarizability: 325.992376|-8.1098255|151.2257643|22.0335455|41.5308312|129.8654047 unknown
InChI: InChI=1S/C13H14N4O/c14-9-3-1-7(5-11(9)16)13(18)8-2-4-10(15)12(17)6-8/h1-6H,14-17H2
charge 0 multiplicity 1
32 atoms
O  -0.045328 1.990297 1.747692
N  -3.156868 -2.637558 -0.722818
N  4.758237 0.149105 1.687119
N  -5.279022 -0.865713 -0.687354
N  4.973384 -1.167816 -0.737173
C  -1.406652 0.515004 0.426196
C  1.1940 0.394996 0.445614
C  -0.084651 1.017562 0.917122
C  -1.623482 -0.834237 0.027419
C  2.345751 0.54009 1.267366
C  -2.901251 -1.288865 -0.357856
C  3.600042 0.042346 0.874251
C  -2.507901 1.412164 0.416056
C  1.340275 -0.221272 -0.826801
C  -4.010025 -0.378487 -0.337531
C  3.723249 -0.638735 -0.386162
C  -3.786053 0.974345 0.028753
C  2.591474 -0.725856 -1.235308
H  -0.788805 -1.544623 0.043869
H  2.231931 1.086355 2.211373
H  -2.339559 2.44451 0.737433
H  0.486436 -0.276771 -1.508684
H  -4.632217 1.672813 0.038607
H  2.693366 -1.208681 -2.215455
H  -2.387221 -3.298873 -0.622479
H  -3.753008 -2.793291 -1.538841
H  4.630815 0.553261 2.614947
H  5.628938 0.416107 1.221768
H  -5.467037 -1.854346 -0.515194
H  -6.074941 -0.232426 -0.642048
H  5.606894 -1.4330 0.017365
H  5.070827 -1.663603 -1.620546
