program: Gaussian 09
title: 000081586
version: EM64L-G09RevD.01
frameworkgroup: C1[X(C13H16O4)]
method: RPBEPBE
basis: SDD
operation: Freq
keyword: #pfreq=noraman
keyword: PBEPBE/SDD
title: #p freq=noraman PBEPBE/SDD
converged: YES YES NO NO
title: Mulliken charges:
elementType: O O O O C C C C C C C C C C C C C H H H H H H H H H H H H H H H H
charge: -0.291076 -0.268222 -0.428945 -0.346879 0.586596 0.125299 -0.523765 -0.627508 -0.601076 0.254944 0.015656 0.230656 -0.026623 -0.220730 -0.670775 -0.517339 -0.588417 0.282030 0.217648 0.226655 0.259900 0.229944 0.233676 0.232446 0.391547 0.214265 0.232682 0.232956 0.272622 0.209794 0.227679 0.214915 0.219443
chargesum: 0.00000
title: Mulliken charges with hydrogens summed into heavy atoms:
elementType: O O O O C C C C C C C C C C C C C
charge: -0.291076 -0.268222 -0.037398 -0.346879 0.586596 0.125299 -0.241734 -0.183204 -0.341176 0.254944 0.015656 0.230656 0.203321 0.245392 0.009128 0.192756 -0.154058
polarizability: 2.17206512e+02 -1.35316800e+01 1.88973985e+02 2.07216782e+00 -6.39608780e+00 9.02504358e+01
1716.lowfreq: -4.0268 -0.0007 -0.0007 -0.0005 5.5274 6.8693 27.5130 38.4410 55.1203
frequency: 27.3801 38.4126 55.0913 56.4216 69.9359 90.6996 102.6077 118.6788 137.0321 153.5612 188.3014 206.0991 234.6927 250.0536 267.0771 297.7463 318.4718 353.0903 370.5815 398.5210 402.3104 441.4595 462.6776 498.7601 526.0954 588.6398 635.1482 666.4823 698.3912 737.2632 762.1987 779.0638 799.2881 816.5573 875.0185 876.8456 883.8853 920.2062 926.1066 936.3893 949.4806 952.3753 1012.1998 1018.2464 1029.7682 1109.6967 1113.1537 1113.4334 1117.1933 1135.0799 1158.4415 1175.5900 1214.9903 1226.1150 1249.4093 1254.9891 1279.2979 1290.7362 1309.3222 1354.2945 1385.2329 1402.3488 1407.9441 1411.9853 1425.3487 1438.3070 1445.8803 1455.4120 1456.8326 1463.4520 1472.6885 1480.7271 1486.5033 1548.4523 1599.0149 1634.3833 1656.3598 2905.4231 2966.2872 2980.0635 2998.1406 3015.1751 3015.7142 3075.0086 3082.3960 3092.9320 3094.7495 3095.6162 3111.0367 3135.7799 3143.6927 3166.9824 3195.5007
redmass: 2.9951 3.1533 2.0089 3.3909 2.5724 3.0454 3.6122 2.2467 4.2989 1.9659 3.1955 3.4556 3.2181 1.4748 3.8416 4.7080 3.5053 5.0482 2.9406 5.9274 4.4489 5.7768 4.3025 3.7643 3.0303 2.9005 4.1699 2.7125 6.1319 7.6058 5.3401 4.3868 1.1058 3.8301 1.3395 1.6731 2.4790 1.5036 1.5985 1.8630 1.4992 3.8934 1.1740 2.5548 3.8611 2.4034 2.2545 1.2449 1.8193 1.4551 1.4495 1.9605 1.3630 2.1715 1.1365 2.1745 1.6174 1.4312 2.5661 1.5583 2.8967 1.4378 2.8948 2.3637 1.2100 1.3944 2.8224 1.0861 1.1757 1.0397 1.0649 1.0532 1.0719 6.0274 3.9445 4.6018 4.6966 1.0700 1.0593 1.0356 1.0359 1.0582 1.0998 1.1067 1.0645 1.0956 1.0985 1.0891 1.1029 1.1056 1.0915 1.0918 1.1143
irintensity: 0.0919 0.8261 7.2719 0.0425 1.1935 0.3111 1.5891 0.6890 0.4096 4.1046 1.1471 4.3840 1.0798 0.7312 1.5549 3.5757 5.2861 8.3033 0.9243 9.4869 24.6557 2.0025 3.9649 3.9947 5.3640 11.6881 1.8610 17.5052 1.9736 1.5674 11.7815 6.1414 2.8524 0.7112 133.0836 27.0225 33.4819 9.6990 3.2211 15.9863 67.9196 35.5392 19.8336 39.2649 207.9130 30.6914 3.8938 12.4255 5.1883 5.8943 3.6093 229.0748 28.4872 9.4060 0.1782 197.9038 80.3649 110.6804 326.5558 72.3847 122.6174 15.0408 113.6608 1.8968 4.0029 80.5997 191.7835 12.6383 15.4395 12.9594 3.5208 27.3431 11.7389 53.6436 28.8895 61.2661 16.3963 392.0186 27.4429 86.7173 17.6585 19.0333 12.2371 5.6117 17.7409 40.1361 28.5028 7.4450 41.2524 12.1510 4.8726 0.8059 27.1411
temp: 298.150 k
press: 1.00000 atm
elementType: 8 8 8 8 6 6 6 6 6 6 6 6 6 6 6 6 6 1 1 1 1 1 1 1 1 1 1 1 1 1 1 1 1
symmnumber: 1
zpe: 689506.2 jmol-1
zpe.correction: 0.262619 hartree
zpe.thermalcorrener: 0.280635 hartree
zpe.thermalcorrenthalpy: 0.281579 hartree
zpe.thermalcorrgfe: 0.214920 hartree
zpe.sumelectzpe: -804.578412 hartree
zpe.sumelectthermal: -804.560396 hartree
zpe.sumelectthermalent: -804.559452 hartree
zpe.sumelectthermalfe: -804.626111 hartree
dipole: -2.6743 0.7388 1.1590
dipole: 3.0068
quadrupole: -86.4334 -100.6247 -99.9403
quadrupole: 3.3031 4.7660 -2.5956
quadrupole: 9.2327 -4.9586 -4.2742 3.3031 4.7660 -2.5956
hfenergy: -804.8410312 hartree
pointgroup: C01 [X(C13H16O4)]
dipole: -0.7689572 0.7713022 0.4617596 debye
polarizability: 199.6267959|-20.3413616|204.6182247|-7.5881489|-12.8681295|92.1859123 unknown
InChI: InChI=1S/C13H16O4/c1-4-6-9-7-10(13(15)17-5-2)12(14)11(8-9)16-3/h4,7-8,14H,1,5-6H2,2-3H3
charge 0 multiplicity 1
33 atoms
O  3.072485 -2.087367 -0.167118
O  -2.59212 0.297303 0.327751
O  0.283153 -2.800886 0.202742
O  -2.127431 -1.975784 0.416283
C  1.468583 1.263113 -0.231229
C  -0.301044 -0.404038 0.12419
C  0.11185 0.946802 -0.040727
C  1.927033 2.704671 -0.462152
C  2.414902 0.203904 -0.229999
C  2.041434 -1.144889 -0.066744
C  0.659404 -1.473233 0.096071
C  -1.715507 -0.765864 0.298332
C  1.200142 3.728377 0.389577
C  -4.042806 -0.037764 0.501533
C  -4.799126 1.285353 0.482887
C  3.083074 -3.243343 0.756636
C  0.534133 4.808069 -0.091097
H  -0.645631 1.735388 -0.020241
H  3.014684 2.765834 -0.254204
H  1.800111 2.970347 -1.530956
H  3.483363 0.409104 -0.362274
H  1.239652 3.557012 1.476329
H  -4.340516 -0.71307 -0.320295
H  -4.157219 -0.58239 1.455752
H  -0.739258 -2.821308 0.305653
H  -5.880463 1.095829 0.610496
H  -4.46314 1.944536 1.301223
H  -4.649699 1.81279 -0.474466
H  2.208537 -3.890179 0.591116
H  3.099421 -2.895445 1.807542
H  4.019221 -3.7729 0.52327
H  0.042372 5.52458 0.576312
H  0.464808 5.007248 -1.168195
