program: Gaussian 09
title: 000078660
version: EM64L-G09RevD.01
frameworkgroup: C1[X(C11H14O)]
method: RPBEPBE
basis: SDD
operation: Freq
keyword: #pfreq=noraman
keyword: PBEPBE/SDD
title: #p freq=noraman PBEPBE/SDD
converged: NO YES NO NO
title: Mulliken charges:
elementType: O C C C C C C C C C C C H H H H H H H H H H H H H H
charge: -0.440607 0.194504 -0.490111 0.337486 -0.581003 0.286673 -0.726341 -0.746240 -0.575705 -0.400125 0.300036 -0.407323 0.219393 0.212312 0.226139 0.223067 0.211041 0.227590 0.219668 0.222127 0.213366 0.210192 0.260904 0.237498 0.214783 0.350676
chargesum: 0.00000
title: Mulliken charges with hydrogens summed into heavy atoms:
elementType: O C C C C C C C C C C C
charge: -0.089931 0.194504 -0.058406 0.337486 -0.131797 0.286673 -0.068042 -0.100555 -0.314801 -0.162627 0.300036 -0.192540
polarizability: 1.51373896e+02 6.03266251e-01 1.24987777e+02 -7.94840787e-02 3.70491453e-02 7.57766649e+01
1716.lowfreq: -9.0471 -2.8782 -0.0006 -0.0003 0.0005 6.3068 88.0292 116.0979 173.0455
frequency: 88.0236 116.0965 173.0450 207.9048 223.8591 260.9143 272.9480 311.3415 324.0669 343.2597 369.5061 379.0559 433.1083 455.6825 495.0239 544.4076 588.1037 614.2440 686.5515 727.9097 763.0337 774.5687 796.0437 885.8251 893.8871 897.4430 921.3451 927.3013 946.6261 970.7324 995.4792 1024.3698 1061.6462 1102.0263 1116.5667 1144.2184 1160.0872 1192.2368 1201.9187 1210.9865 1231.1964 1264.0960 1281.0176 1296.0868 1312.3880 1374.5049 1391.0587 1392.7175 1447.3816 1458.0206 1463.7900 1470.0537 1475.8430 1478.2972 1487.9722 1489.0691 1595.9960 1630.2195 2967.9071 2970.1678 2971.3096 2992.4070 3038.4937 3059.5279 3061.9559 3067.2176 3073.0320 3075.6278 3107.2934 3136.1958 3150.6978 3580.5222
redmass: 3.4047 3.1246 2.6211 2.8518 1.0334 1.1259 2.5905 2.6400 3.1066 1.1255 3.0691 2.5191 4.8873 2.8271 3.2252 3.8918 3.3809 3.7554 3.7186 3.3176 4.8093 2.0840 1.4415 1.5427 1.9005 3.1677 1.5064 1.5697 1.7083 1.6674 1.7294 1.5809 2.3263 1.3940 1.6143 1.4069 1.3801 2.0727 1.9309 2.1429 2.2316 1.4236 2.2277 1.8115 1.6992 1.1991 2.7510 1.5721 2.6458 1.1073 1.0683 1.1107 1.1215 1.0599 1.1242 2.5915 7.4684 6.9905 1.0363 1.0599 1.0390 1.0627 1.0946 1.1013 1.1015 1.0995 1.1001 1.0994 1.0878 1.0960 1.0920 1.0660
irintensity: 0.0288 3.2349 0.4251 1.8975 0.0258 0.2930 1.6207 2.2736 2.1906 140.8847 5.5575 0.6311 4.3226 10.4018 0.9373 1.1278 0.5361 5.9761 3.2193 2.2566 12.2800 0.5353 47.6794 18.6933 12.3532 23.7282 4.2207 3.3589 8.6274 3.9372 2.4969 1.4756 17.8577 2.4461 1.0107 142.5203 49.0821 1.6718 0.6418 2.5705 1.4488 16.7633 46.7866 2.8815 14.7372 18.5875 41.6761 20.0937 1.8844 0.5351 1.1900 16.5254 2.3555 15.8577 16.5944 47.9216 30.7255 39.4241 20.6795 56.8000 27.2391 42.1752 33.7021 21.8376 10.4358 63.3188 47.1606 48.8349 17.4056 24.4668 3.4856 31.9216
temp: 298.150 k
press: 1.00000 atm
elementType: 8 6 6 6 6 6 6 6 6 6 6 6 1 1 1 1 1 1 1 1 1 1 1 1 1 1
symmnumber: 1
zpe: 576560.9 jmol-1
zpe.correction: 0.219600 hartree
zpe.thermalcorrener: 0.230814 hartree
zpe.thermalcorrenthalpy: 0.231758 hartree
zpe.thermalcorrgfe: 0.183730 hartree
zpe.sumelectzpe: -501.904322 hartree
zpe.sumelectthermal: -501.893108 hartree
zpe.sumelectthermalent: -501.892164 hartree
zpe.sumelectthermalfe: -501.940192 hartree
dipole: -0.0763 1.4400 0.0624
dipole: 1.4434
quadrupole: -60.6884 -71.7067 -75.3981
quadrupole: -4.4631 -0.0092 -0.1036
quadrupole: 8.5760 -2.4423 -6.1337 -4.4631 -0.0092 -0.1036
hfenergy: -502.1239224 hartree
pointgroup: C01 [X(C11H14O1)]
dipole: -0.032386 -0.5660623 -0.0316146 debye
dipolederiv: -1.0680263 0.6175803 0.0044135 0.7356477 -0.5241732 0.0029739 0.0038136 0.0025378 -0.4236249 0.1269621 0.0294691 0.0074221 -0.0116763 0.1178513 0.0235881 0.0777087 0.0371565 0.1537389 0.1180116 -0.0092124 -0.0545669 -0.0188079 -0.0543375 -0.0048374 0.0152599 0.0115381 0.091901 0.2239884 0.0133476 -0.0333639 0.2152213 0.0838928 -0.018233 -0.0618899 -0.0386689 -0.1058035 0.0099723 -0.0135375 -0.0305931 0.0149644 0.0407748 -0.0368933 0.0194317 -0.0550857 0.1709387 -0.0663921 -0.1896799 0.0000405 -0.3015032 -0.1228773 -0.0052764 -0.0894769 0.0257444 -0.0783298 -0.0260737 -0.0300783 0.0338197 -0.0183951 0.0269796 0.0128998 -0.0463786 -0.010122 -0.0578187 0.015063 -0.0264086 -0.0079433 -0.0026677 -0.0066315 -0.0489149 0.0084776 -0.043531 0.0016543 -0.3532178 0.1762499 0.0100559 -0.0644757 0.0177206 0.0134559 0.0086502 0.0155824 -0.1642353 0.1633499 0.1291989 -0.000138 -0.0256613 0.1182428 0.0051431 0.0182241 0.0085381 -0.1325788 1.0196253 -0.5416997 -0.0017515 -0.6959151 0.4781068 0.0020383 0.0021244 0.0028248 0.0685669 -0.1647021 -0.0137528 0.0016478 0.3865132 -0.2212408 0.0010027 0.0074567 -0.0071362 -0.2227202 0.0769281 -0.0109526 0.002486 -0.0169947 0.0430333 -0.0025519 -0.0653046 0.0155858 -0.1817996 -0.2034766 0.0235332 0.0535256 0.0096455 0.0599105 -0.0086847 0.1046919 -0.0224302 0.05502 0.0250991 -0.0062372 -0.0000397 0.0361425 -0.118244 0.091452 -0.0458057 0.1410096 0.0172551 -0.0389257 0.0595184 0.04012 0.0367387 0.0409952 -0.0570009 0.0724338 -0.1158921 -0.1171312 -0.210564 -0.0862335 0.0454048 -0.0694792 0.0689963 0.0216679 0.026739 0.0211925 0.0607699 0.0910967 -0.0344678 -0.0300632 -0.0138728 -0.0485095 -0.1465327 -0.035218 -0.0971909 -0.0275499 0.0389931 0.1180786 -0.0477472 0.0821972 -0.0744696 0.0936751 -0.0201883 0.0444024 0.0458701 0.0798056 -0.0053359 0.0776008 -0.0127852 0.0632105 0.061404 0.0551164 0.0168667 -0.1430091 -0.2012465 -0.0876439 -0.0282859 -0.0398487 0.0643775 -0.0158072 0.0016887 -0.015737 0.0820097 0.0552941 0.1252457 -0.0313775 0.0668952 -0.1137234 0.031244 -0.0429968 0.0715462 0.0537174 0.1096136 -0.0321236 -0.001568 -0.0113677 -0.0621173 -0.0059742 -0.0022788 -0.0036369 0.1541194 0.075361 -0.0137409 -0.00165 -0.0393148 -0.121607 -0.0039541 -0.0070498 -0.0013867 0.1475138 -0.1574024 -0.0561977 -0.0038251 -0.0360045 0.0663133 -0.001546 -0.0011054 0.0005668 0.1743059 0.2608633 -0.1349194 -0.0036234 -0.2051957 0.1775258 -0.004338 -0.0041237 -0.0042745 0.3772199 unknown
polarizability: 151.3677423|-0.7188415|124.9850074|0.2018359|0.6446615|75.7855884 unknown
InChI: InChI=1S/C11H14O/c1-11(2)6-5-8-3-4-9(12)7-10(8)11/h3-4,7,12H,5-6H2,1-2H3
charge 0 multiplicity 1
26 atoms
O  -3.269591 1.408783 -0.002274
C  1.709517 0.57832 0.018865
C  2.371652 -0.775141 0.463496
C  0.218807 0.205055 0.030593
C  1.402144 -1.903222 -0.004626
C  0.047852 -1.204865 0.004705
C  2.139293 0.948106 -1.431906
C  2.060612 1.738512 0.978334
C  -0.890918 1.068468 0.020247
C  -1.24671 -1.757741 -0.024666
C  -2.18853 0.503309 -0.004411
C  -2.374376 -0.901301 -0.026929
H  2.441576 -0.792626 1.568434
H  3.393043 -0.88977 0.057236
H  1.438882 -2.792883 0.650102
H  1.658177 -2.246478 -1.028044
H  3.219386 1.186625 -1.46531
H  1.945551 0.115143 -2.132477
H  1.579703 1.830129 -1.794412
H  1.721153 1.520067 2.007296
H  3.154664 1.903355 1.002195
H  1.588174 2.685589 0.656191
H  -0.788875 2.158309 0.042278
H  -1.392515 -2.844196 -0.040637
H  -3.388952 -1.321925 -0.040447
H  -4.131518 0.92338 -0.016432
