program: Gaussian 09
title: 000078664
version: EM64L-G09RevD.01
frameworkgroup: C1[X(C17H22N2)]
method: RPBEPBE
basis: SDD
operation: Freq
keyword: #pfreq=noraman
keyword: PBEPBE/SDD
title: #p freq=noraman PBEPBE/SDD
converged: YES YES NO NO
title: Mulliken charges:
elementType: N N C C C C C C C C C C C C C C C C C H H H H H H H H H H H H H H H H H H H H H H
charge: -0.432132 -0.523318 -0.444362 -0.332686 -0.342557 -0.351571 0.469577 -0.693296 -0.419397 -0.373655 0.459486 -0.437528 -0.398115 0.454571 -0.449896 -0.389074 -0.197619 -0.216411 -0.274966 0.200973 0.207474 0.189565 0.189630 0.207656 0.207606 0.194368 0.195218 0.291555 0.217940 0.210535 0.210670 0.213126 0.238404 0.228465 0.261106 0.288566 0.217161 0.262156 0.219055 0.218136 0.223581
chargesum: 0.00000
title: Mulliken charges with hydrogens summed into heavy atoms:
elementType: N N C C C C C C C C C C C C C C C C C
charge: -0.140577 -0.234752 -0.035915 0.046509 0.072705 0.038015 0.469577 -0.054151 -0.206270 -0.135251 0.459486 -0.209063 -0.137009 0.454571 -0.232735 -0.126917 0.021436 0.001725 -0.051384
polarizability: 3.49036001e+02 -2.60903748e+01 1.93007605e+02 -1.15641509e+01 -3.02938665e+00 1.17640002e+02
1716.lowfreq: -6.1962 -4.6605 0.0004 0.0012 0.0014 3.1378 21.3079 29.2195 37.4109
frequency: 21.2741 29.2046 37.2008 46.5479 53.6482 68.7693 97.8916 105.9227 138.8950 152.7427 173.8001 193.4566 209.3541 229.4146 266.3241 290.2243 309.5716 337.0033 366.6107 407.4579 413.0181 438.6767 447.3985 488.7438 501.9098 509.9382 570.2854 609.4532 618.9570 642.5199 691.7759 708.1650 728.8287 750.2799 764.4908 785.7895 801.7356 815.2938 826.2913 827.8553 854.6627 866.6161 881.9757 893.3448 922.0726 942.5489 960.5917 971.6177 977.7193 979.9819 994.0732 1015.9919 1024.2620 1054.0750 1077.6796 1085.5893 1095.5124 1116.6646 1144.0235 1155.5728 1168.3269 1185.8873 1189.8772 1206.9499 1227.0215 1242.4569 1262.7017 1269.4972 1283.5274 1285.7350 1292.9953 1315.9677 1320.2851 1330.8396 1353.6579 1366.9299 1371.3774 1384.3437 1390.4906 1424.7540 1433.6756 1465.4497 1467.6798 1469.2447 1477.4182 1478.5192 1486.6525 1488.0062 1502.3620 1512.1844 1525.4601 1583.0695 1592.8807 1619.2011 1644.3036 2915.0161 2952.3977 2957.3721 2962.3240 2971.5124 2973.9822 2996.3931 3015.9251 3039.4358 3070.3253 3074.0104 3106.9748 3107.2751 3124.1748 3132.7028 3136.1782 3142.0541 3157.7504 3164.0199 3169.5989 3543.2037 3571.3659
redmass: 4.0466 4.3042 2.7416 1.9581 3.7711 3.7866 3.7429 1.6883 2.6988 3.5765 4.6113 4.7099 3.9874 1.1187 1.0990 3.8426 4.8582 4.4148 2.7355 2.9337 3.0899 3.0045 1.5326 3.7694 2.7630 2.4929 5.4982 5.4855 5.9786 6.7163 1.9773 3.6758 1.0692 1.7527 1.1168 2.7891 1.4079 2.1210 1.3300 3.6952 1.1833 4.9288 1.4741 1.8972 1.3626 1.3333 1.3488 1.1439 1.3133 5.3176 2.7596 3.5056 2.1451 2.9734 2.4508 1.5665 2.4248 1.6441 2.3319 1.5611 1.0501 1.1109 1.1351 1.4146 2.6104 1.3395 1.1903 1.4931 1.5602 1.0990 1.1101 1.6488 1.4551 1.5012 1.6014 2.0954 2.7525 4.2460 1.2203 3.6414 2.2456 1.1099 1.5362 1.1879 1.0444 1.0707 2.0498 1.1190 1.1290 2.1620 3.0088 5.5452 4.1602 6.2434 6.6356 1.0585 1.1000 1.0591 1.0592 1.0591 1.0362 1.0985 1.1029 1.1047 1.1007 1.0993 1.0867 1.0872 1.0862 1.0966 1.0930 1.0872 1.0947 1.0967 1.0983 1.0753 1.0770
irintensity: 0.4314 0.3460 0.5333 2.3042 0.3399 1.3349 1.4409 7.8086 4.4532 1.1085 1.3489 0.5517 5.4476 0.3654 75.1893 4.6014 0.4698 4.3834 31.2994 1.1021 1.5402 5.1349 139.2080 5.0394 9.6945 13.3762 7.3279 1.7694 5.7827 0.4827 42.8670 1.6700 11.8839 79.2545 0.1860 29.3063 0.8580 55.8300 7.1737 17.2092 0.0624 4.0690 5.3799 8.8518 0.3696 0.3538 0.3595 0.9431 0.6283 8.2029 0.1060 1.5322 10.9328 0.4793 0.1426 9.7459 1.9049 16.7566 21.3012 1.1630 1.0284 1.2490 20.3943 0.3380 6.8980 6.2841 0.2667 27.3579 41.4868 3.8329 1.1237 163.2406 35.5342 3.7226 0.6497 9.5097 23.0978 59.9398 14.2674 3.6823 46.8487 4.2373 14.2858 1.2550 12.5703 14.8813 115.3435 22.6279 146.9129 122.1368 686.7183 1.6135 17.8856 237.8020 63.0322 64.0315 28.0678 1.6462 6.6285 109.1732 37.8211 1.7218 1.6962 84.6432 89.5785 54.0854 34.6714 8.4198 3.6209 25.4443 33.1005 33.9201 30.0860 11.0050 10.6804 17.5593 45.9247
temp: 298.150 k
press: 1.00000 atm
elementType: 7 7 6 6 6 6 6 6 6 6 6 6 6 6 6 6 6 6 6 1 1 1 1 1 1 1 1 1 1 1 1 1 1 1 1 1 1 1 1 1 1
symmnumber: 1
zpe: 917506.0 jmol-1
zpe.correction: 0.349460 hartree
zpe.thermalcorrener: 0.368824 hartree
zpe.thermalcorrenthalpy: 0.369768 hartree
zpe.thermalcorrgfe: 0.299066 hartree
zpe.sumelectzpe: -769.111293 hartree
zpe.sumelectthermal: -769.091929 hartree
zpe.sumelectthermalent: -769.090984 hartree
zpe.sumelectthermalfe: -769.161687 hartree
dipole: -3.5224 1.3216 -0.1173
dipole: 3.7640
quadrupole: -103.8460 -104.6917 -119.9464
quadrupole: 3.0949 -4.2624 -0.8897
quadrupole: 5.6487 4.8030 -10.4517 3.0949 -4.2624 -0.8897
hfenergy: -769.4607526 hartree
pointgroup: C01 [X(C17H22N2)]
dipole: 1.3939244 0.4952811 0.0679133 debye
polarizability: 349.8315228|24.0640169|191.7941171|-10.452187|6.4440988|118.0579688 unknown
InChI: InChI=1S/C17H22N2/c1-2-3-7-14-18-15-10-12-17(13-11-15)19-16-8-5-4-6-9-16/h4-6,8-13,18-19H,2-3,7,14H2,1H3
charge 0 multiplicity 1
41 atoms
N  2.700397 1.037867 -0.193025
N  -2.97098 1.123625 0.350588
C  5.036302 0.21656 -0.175059
C  5.976794 -0.964774 0.149401
C  3.556749 -0.110962 0.106457
C  7.463588 -0.651293 -0.134005
C  1.309817 1.032029 -0.058139
C  8.399114 -1.833919 0.197177
C  0.55243 2.208219 -0.34055
C  0.597307 -0.130576 0.360609
C  -1.557102 1.050903 0.18799
C  -0.848837 2.210429 -0.232737
C  -0.805669 -0.113906 0.491918
C  -3.931205 0.116919 0.136359
C  -5.248749 0.310677 0.649306
C  -3.658552 -1.069509 -0.60569
C  -6.256164 -0.648468 0.427079
C  -4.675483 -2.024481 -0.813122
C  -5.979907 -1.830805 -0.300622
H  5.336733 1.099693 0.426755
H  5.15155 0.498341 -1.24197
H  5.67229 -1.852482 -0.442894
H  5.86089 -1.24616 1.216651
H  3.252442 -0.986157 -0.508797
H  3.44475 -0.415892 1.171387
H  7.767415 0.238271 0.454759
H  7.580922 -0.373561 -1.201339
H  3.153499 1.908666 -0.466931
H  9.455116 -1.58584 -0.015246
H  8.325608 -2.111161 1.265778
H  8.135377 -2.727454 -0.399551
H  1.070461 3.120715 -0.662798
H  1.139299 -1.04946 0.60444
H  -1.407331 3.120576 -0.484941
H  -1.317467 -1.008876 0.859344
H  -3.336777 2.025507 0.658901
H  -5.473442 1.21673 1.227461
H  -2.667905 -1.22469 -1.042106
H  -7.260511 -0.474727 0.830855
H  -4.445782 -2.926385 -1.392993
H  -6.761887 -2.578988 -0.4666
