program: Gaussian 09
title: 000078659
version: EM64L-G09RevD.01
frameworkgroup: C1[X(C7H6Br2O3)]
method: RPBEPBE
basis: SDD
operation: Freq
keyword: #p
keyword: freq=noraman
keyword: PBEPBE/SDD
title: #p freq=noraman PBEPBE/SDD
converged: YES YES NO YES
title: Mulliken charges:
elementType: Br Br O O O C C C C C C C H H H H H H
charge: 0.041690 0.065601 -0.422384 -0.426178 -0.451926 0.625726 -0.559162 -0.394630 0.204289 -0.523333 0.250378 -0.260665 0.270357 0.236224 0.227140 0.391082 0.351736 0.374056
chargesum: 0.00000
title: Mulliken charges with hydrogens summed into heavy atoms:
elementType: Br Br O O O C C C C C C C
charge: 0.041690 0.065601 -0.031301 -0.074442 -0.077870 0.625726 -0.288805 -0.394630 0.204289 -0.059969 0.250378 -0.260665
polarizability: 1.53767060e+02 4.38403053e+00 1.56128984e+02 2.04257491e+00 -2.75403869e+00 5.28948303e+01
1716.lowfreq: -9.9334 -4.6304 -0.2603 -0.0004 -0.0004 -0.0001 53.0003 76.6691 107.1808
frequency: 52.9959 76.6659 107.1786 128.7108 132.7530 195.6586 232.6780 254.2020 268.0103 288.7132 299.2410 349.2735 382.9627 386.9225 395.7803 474.7293 480.2085 518.4016 565.9483 622.2997 663.3965 714.4350 770.6669 822.0220 872.9825 922.7474 971.9637 993.1633 1106.6465 1160.4289 1168.7829 1178.2930 1252.4212 1304.8962 1318.8438 1365.2137 1391.9814 1421.5274 1455.5132 1465.5241 1573.4340 1617.4866 2979.6728 3093.3271 3169.3684 3512.7166 3526.6933 3536.9364
redmass: 12.4294 4.7606 7.6108 26.0360 11.3070 7.7138 6.5086 4.5980 5.3647 5.6392 6.5398 2.6092 2.0736 2.7394 1.2020 2.3606 1.4970 5.1231 5.4148 5.9547 8.9443 5.0362 6.7700 6.9855 1.5559 3.5340 1.8959 5.7908 2.9502 1.1442 1.7254 1.3488 3.2840 2.1361 1.3507 1.8775 1.9363 3.8542 1.7770 1.8976 6.9091 7.1567 1.0673 1.0964 1.0925 1.0653 1.0650 1.0660
irintensity: 0.3754 3.4876 0.2469 0.0316 0.2528 2.4635 1.7180 6.0936 9.0663 4.9399 3.2825 35.9845 93.2147 55.9641 178.5936 40.3138 117.5281 2.2060 26.0109 8.1860 23.6935 5.6205 32.5402 29.6064 24.5309 58.3822 9.0352 97.5626 107.6042 23.1666 179.9472 36.8992 320.8522 64.2166 25.6860 22.7027 23.5976 12.9076 62.9670 67.7063 52.4342 3.2420 46.4744 16.5739 1.5686 71.7112 95.1772 5.1705
temp: 298.150 k
press: 1.00000 atm
elementType: 35 35 8 8 8 6 6 6 6 6 6 6 1 1 1 1 1 1
symmnumber: 1
zpe: 308304.1 jmol-1
zpe.correction: 0.117427 hartree
zpe.thermalcorrener: 0.129907 hartree
zpe.thermalcorrenthalpy: 0.130851 hartree
zpe.thermalcorrgfe: 0.077141 hartree
zpe.sumelectzpe: -522.022604 hartree
zpe.sumelectthermal: -522.010124 hartree
zpe.sumelectthermalent: -522.009180 hartree
zpe.sumelectthermalfe: -522.062890 hartree
dipole: 2.2890 -1.5501 -0.9614
dipole: 2.9269
quadrupole: -82.1849 -91.6605 -91.4352
quadrupole: 1.5101 4.6724 -4.4570
quadrupole: 6.2420 -3.2337 -3.0084 1.5101 4.6724 -4.4570
hfenergy: -522.1400312 hartree
pointgroup: C01 [X(C7H6Br2O3)]
dipole: 0.9096848 0.6216745 0.3346772 debye
dipolederiv: -0.2853894 0.2760082 -0.0107945 0.2485945 -0.3262458 -0.0166035 -0.0299835 -0.0048848 -0.010766 -0.1830752 -0.2121288 0.0316819 -0.2147332 -0.4722108 0.0537644 0.0348181 0.0617844 0.0125234 -0.8215908 0.7246392 -0.0368451 0.6816217 -0.9040699 -0.0099932 -0.0276056 -0.0149278 -0.4053077 -0.8993342 -0.0864776 -0.0452403 0.0207424 -0.1837933 0.0518887 -0.2180999 -0.0398139 -0.6330059 -1.3606159 -0.1013082 0.0739192 -0.1408018 -0.2544714 -0.0044153 0.0970891 -0.0038596 -0.4060886 -0.2898701 -0.0620475 -0.0060984 0.1159295 -0.1392435 -0.0130087 0.0763303 0.0638356 -0.0604309 -0.1075537 0.1564671 -0.0206818 -0.0024443 0.0005835 -0.0112369 -0.0162847 -0.0176412 -0.1651261 0.2664562 -0.3333739 -0.0112649 -0.7030974 0.3474114 0.0312562 0.0547952 -0.0287307 -0.1240844 0.6039005 -0.566167 0.0174122 -0.8875858 0.8638139 -0.0006333 0.0397636 -0.0221178 0.1036658 0.730135 0.1801679 0.0805999 0.0035277 0.2796371 -0.0392676 0.1370423 -0.0006939 0.5186871 0.9592179 -0.0351256 -0.0645774 0.3694559 -0.4016428 0.0091122 -0.1167238 0.0388839 0.0455368 0.0797763 0.2874696 -0.0358365 0.6649301 0.680267 -0.1092754 -0.0749103 -0.0846996 -0.066803 0.0710524 -0.0400259 0.0144533 -0.0167977 -0.0151931 0.0181727 0.007278 0.0167715 0.1636502 0.0562113 0.0055514 -0.0286749 -0.0403953 -0.1016494 0.0881183 -0.0199687 0.0250726 0.0557968 -0.0644997 0.0011572 0.0322875 0.0710672 0.0199621 -0.1363809 0.0066723 -0.0585981 -0.1003164 0.330216 -0.1910236 0.0246713 -0.1450968 0.3256435 0.0181818 0.0192303 0.02312 0.3921719 0.4494183 0.003113 -0.0106556 0.0115445 0.0516855 0.0516616 0.0342419 0.031657 0.2973873 0.4655451 -0.0068955 -0.004356 -0.0364612 0.2295158 0.0186591 -0.0036845 0.0148424 0.3825097 unknown
polarizability: 153.6346265|-4.5708085|155.6345609|-3.1335846|-8.0210776|53.5216871 unknown
InChI: InChI=1S/C7H6Br2O3/c8-5-3(2-10)1-4(11)7(12)6(5)9/h1,10-12H,2H2
charge 0 multiplicity 1
18 atoms
Br -1.945758 2.334542 0.039704
Br 1.465824 2.880366 -0.285111
O  2.05008 -2.378156 0.132438
O  -3.391249 -0.664186 -0.891454
O  3.017258 0.126664 -0.169712
C  -1.160313 -0.485991 0.23221
C  -0.226287 -1.550918 0.248434
C  -0.674924 0.83853 0.07549
C  1.151159 -1.315595 0.11306
C  -2.645706 -0.796569 0.372151
C  1.6272 0.013774 -0.0433
C  0.710138 1.086059 -0.063749
H  -0.571489 -2.582923 0.357902
H  -2.775592 -1.853039 0.653121
H  -3.099428 -0.159943 1.158792
H  2.974345 -2.03147 0.018017
H  -3.43379 0.297385 -1.132597
H  3.293133 1.074269 -0.279396
