program: Gaussian 09
title: 000078663
version: EM64L-G09RevD.01
frameworkgroup: C1[X(C6H10Br2N2O2)]
method: RPBEPBE
basis: SDD
operation: Freq
keyword: #p
keyword: freq=noraman
keyword: PBEPBE/SDD
title: #p freq=noraman PBEPBE/SDD
converged: YES YES NO NO
title: Mulliken charges:
elementType: Br Br O O N N C C C C C C H H H H H H H H H H
charge: -0.036212 -0.028163 -0.261609 -0.233656 -0.354922 -0.382690 -0.023826 -0.696305 0.325633 0.290701 -0.749612 -0.747014 0.292909 0.234154 0.209712 0.265770 0.324264 0.324187 0.307451 0.313636 0.313307 0.312285
chargesum: 0.00000
title: Mulliken charges with hydrogens summed into heavy atoms:
elementType: Br Br O O N N C C C C C C
charge: -0.036212 -0.028163 -0.261609 -0.233656 -0.030658 -0.058504 0.269083 0.013330 0.325633 0.290701 -0.128525 -0.121422
polarizability: 1.31253213e+02 1.17900787e+01 1.18124883e+02 1.41782034e+01 8.80556939e+00 9.91130558e+01
1716.lowfreq: -1.0961 -0.0006 -0.0005 0.0006 2.8469 8.0472 15.4049 19.5994 28.5690
frequency: 15.3629 19.5321 28.5618 65.7892 75.6923 92.9649 105.1646 134.0365 170.5846 218.7199 252.0354 302.2451 306.5507 376.8042 407.4739 463.5054 541.3223 559.5417 576.2459 602.0487 618.8046 637.2250 640.5813 650.3588 871.8018 872.7324 888.8244 901.4967 953.0496 990.0881 1114.9140 1120.5606 1142.4797 1144.6978 1157.2229 1224.6193 1227.7285 1237.4206 1257.9084 1317.6056 1370.4195 1391.0157 1411.7657 1413.5440 1459.8561 1478.1930 1480.1488 1506.0835 1595.3646 1611.9457 2989.7876 3037.9130 3069.4030 3069.6886 3089.1267 3111.9315 3151.2375 3152.9588 3497.1482 3507.1316
redmass: 6.7481 8.6154 9.3621 3.9015 3.3054 5.1875 5.2168 3.8339 5.5958 2.2943 1.4923 6.7246 9.9848 4.0669 4.1280 3.2793 3.9432 2.4645 3.0598 1.4591 3.7938 2.3462 1.8245 3.3066 1.7305 1.7378 1.9036 3.5719 6.2420 2.3521 3.1879 2.4551 1.1358 1.1389 2.4887 1.4043 1.2535 1.4735 2.0635 1.4778 1.2221 1.2262 1.1031 1.0960 1.2176 1.6378 1.0648 2.0184 8.3526 9.5322 1.0374 1.0854 1.0567 1.0566 1.0997 1.0996 1.1086 1.1087 1.0781 1.0784
irintensity: 0.5420 0.3130 1.3945 14.2831 14.4217 1.3687 3.4576 1.7843 5.4890 16.4630 7.4748 2.1098 4.3963 19.3980 5.7412 3.4881 8.4259 42.7306 2.7127 57.5408 18.6261 124.0508 108.1693 23.5033 12.4877 15.4928 4.1288 1.2094 1.0822 0.2710 22.8566 4.7245 0.7521 0.5091 102.3796 16.8890 40.9676 32.8916 43.3824 25.2333 10.7017 32.3235 60.5909 33.1173 199.9219 352.6274 11.8910 137.3917 121.8716 209.8163 16.3887 1.4337 1.5330 2.0033 24.8925 12.8103 0.0014 0.0960 57.3063 49.5733
temp: 298.150 k
press: 1.00000 atm
elementType: 35 35 8 8 7 7 6 6 6 6 6 6 1 1 1 1 1 1 1 1 1 1
symmnumber: 1
zpe: 428735.4 jmol-1
zpe.correction: 0.163297 hartree
zpe.thermalcorrener: 0.177711 hartree
zpe.thermalcorrenthalpy: 0.178655 hartree
zpe.thermalcorrgfe: 0.116147 hartree
zpe.sumelectzpe: -520.598400 hartree
zpe.sumelectthermal: -520.583985 hartree
zpe.sumelectthermalent: -520.583041 hartree
zpe.sumelectthermalfe: -520.645549 hartree
dipole: -1.6400 -0.9316 -2.5398
dipole: 3.1635
quadrupole: -91.8897 -98.8119 -92.1543
quadrupole: -4.7513 -1.8890 -7.1781
quadrupole: 2.3956 -4.5266 2.1310 -4.7513 -1.8890 -7.1781
hfenergy: -520.7616966 hartree
pointgroup: C01 [X(C6H10Br2N2O2)]
dipole: 0.4935998 -0.8668882 0.7442725 debye
dipolederiv: -0.2128683 0.0080552 -0.0379043 -0.196179 -0.5644582 -0.2565674 -0.1104646 -0.1493626 -0.2315381 -0.3863484 0.1778186 -0.0270097 0.3117599 -0.3829466 0.1073358 -0.1736884 0.1959808 -0.2422023 -0.7082447 -0.1097308 -0.1937357 0.3562725 -0.9011786 -0.097613 -0.0434595 -0.3261229 -0.5004481 -0.66945 0.3052537 -0.1550071 0.015855 -0.6468434 0.3619502 0.2822013 0.1410584 -0.6692436 -1.3258419 0.1968921 -0.1835206 0.220502 -0.4703965 0.0013805 -0.2657849 -0.00061 -0.6158432 -1.0487963 -0.0667369 0.3028905 -0.0555791 -0.3913485 0.0179823 0.5468267 0.0148188 -0.9110962 1.3015365 0.0265002 -0.0344997 0.0917343 0.2646998 0.2186067 0.0880044 0.1117979 0.6501462 -0.1612246 0.0432636 0.0356623 -0.0063439 0.1040778 -0.0132365 0.024296 -0.0275947 -0.1301805 1.3374474 -0.0307582 0.5258594 -0.7879998 0.8112326 -0.0290296 0.3025304 0.2905036 0.4583097 1.0105344 -0.3256169 -0.1753424 0.1529291 0.5149145 -0.4919796 -0.964781 -0.1437004 0.9961912 -0.1162207 -0.1559028 -0.1555213 0.1856906 0.8017118 0.329449 -0.0568999 0.1772237 0.1135475 0.0875522 -0.143963 0.2065155 -0.3450335 0.4708534 -0.2628608 0.4760461 -0.4206922 0.253531 0.0394436 0.0137073 0.029219 -0.061657 0.0179068 -0.0172762 -0.0469021 0.0656392 0.0325745 -0.0406185 -0.0901849 -0.1085605 -0.096576 0.0522133 -0.0375525 -0.1184777 -0.0258985 0.0149359 0.1127956 0.0057763 -0.0132602 0.0054227 -0.1274696 0.0803912 0.012087 -0.0011259 0.0505545 -0.0382509 0.0630437 0.0800638 0.064948 0.0709975 -0.0222478 0.0637296 0.0128606 0.095263 0.2938921 0.072473 -0.0231687 0.0972602 0.1898231 -0.005689 -0.0101601 0.0132184 0.2841653 0.3257418 -0.028937 0.0031654 -0.0161021 0.2520273 0.0703665 0.017781 0.0747178 0.2054706 0.0069634 -0.0171101 0.0243214 0.0139184 -0.0205247 -0.0787312 0.0688733 -0.0426916 0.0707825 0.1071405 -0.0055839 -0.0042107 0.0027161 -0.0487517 0.0325798 -0.0380917 -0.024645 0.0200538 0.0132322 0.0279782 -0.0283999 -0.0322875 -0.0179132 0.0602924 -0.0258365 0.0734102 0.07745 0.0715844 0.0337625 -0.0675565 0.0787493 0.0213732 0.0324494 -0.0278293 -0.0087856 -0.0224237 unknown
polarizability: 126.7885201|-18.3266541|122.6684531|10.7992285|1.3778198|99.0341794 unknown
InChI: InChI=1S/C6H10Br2N2O2/c1-4(9-5(11)2-7)10-6(12)3-8/h4,9-10H,2-3H2,1H3
charge 0 multiplicity 1
22 atoms
Br -3.045517 -2.14985 -1.679238
Br 4.001375 -2.003581 0.040761
O  -2.400519 1.608446 0.141632
O  1.520119 0.965612 -1.655095
N  -1.073241 -0.29969 -0.005837
N  1.317533 -0.31493 0.286756
C  0.065072 0.309908 0.726557
C  -0.101341 0.177383 2.250298
C  -2.20503 0.421064 -0.271123
C  1.959083 0.076403 -0.866019
C  -3.310461 -0.206015 -1.122473
C  3.286647 -0.587739 -1.239953
H  0.076258 1.37685 0.437693
H  0.724561 0.688481 2.77566
H  -0.126759 -0.883423 2.562055
H  -1.049771 0.651325 2.55019
H  -0.982556 -1.254713 -0.364782
H  1.761052 -1.018776 0.884765
H  -4.260844 -0.185766 -0.569716
H  -3.408526 0.355636 -2.063748
H  4.073992 0.178205 -1.300187
H  3.183572 -1.095627 -2.210396
