program: Gaussian 09
title: 000081557
version: EM64L-G09RevD.01
frameworkgroup: C1[X(C6H8N2O6S2)]
method: RPBEPBE
basis: SDD
operation: Freq
keyword: #p
keyword: freq=noraman
keyword: PBEPBE/SDD
title: #p freq=noraman PBEPBE/SDD
converged: YES YES NO NO
title: Mulliken charges:
elementType: S S O O O O O O N N C C C C C C H H H H H H H H
charge: 0.991038 0.991011 -0.555877 -0.555885 -0.491036 -0.522558 -0.491050 -0.522525 -0.696692 -0.696691 -0.305134 -0.305148 0.625556 0.625613 -0.403758 -0.403765 0.285250 0.285250 0.366532 0.321973 0.366515 0.321979 0.384700 0.384700
chargesum: 0.00000
title: Mulliken charges with hydrogens summed into heavy atoms:
elementType: S S O O O O O O N N C C C C C C
charge: 0.991038 0.991011 -0.171177 -0.171186 -0.491036 -0.522558 -0.491050 -0.522525 -0.008187 -0.008196 -0.305134 -0.305148 0.625556 0.625613 -0.118507 -0.118515
polarizability: 2.28916178e+02 1.35174677e-01 1.71805094e+02 4.61074541e-03 8.04473321e-03 9.74546063e+01
1716.lowfreq: -3.7202 -0.0016 0.0008 0.0018 1.7302 8.8082 33.6509 50.2461 51.6867
frequency: 33.6190 50.2313 51.6836 116.7491 127.0859 130.6224 169.8105 171.8482 174.6607 199.9208 224.9522 244.0822 262.0699 263.1965 288.8099 315.8164 323.6252 327.3675 329.0608 352.5286 384.2040 404.9526 410.2839 424.1846 455.2376 466.6282 477.3430 535.3435 544.5245 550.9506 632.4603 638.1166 668.8797 689.4572 739.9436 795.2710 818.8388 820.2404 885.9094 890.9906 905.4857 947.8450 952.6350 1009.8879 1042.4421 1044.9488 1062.8431 1100.8517 1252.6124 1275.7533 1363.1761 1378.8150 1445.3319 1528.8711 1532.1765 1635.2740 1641.1196 1673.5529 3142.0523 3144.0396 3439.2214 3442.9982 3473.0878 3473.2210 3660.5065 3660.5654
redmass: 8.9579 5.8373 8.6835 7.5176 8.4422 4.8936 7.4342 1.9516 1.6759 4.6288 7.0783 5.8253 2.7252 2.8577 6.7813 8.2623 8.2728 8.3909 11.1350 4.3660 1.6569 3.8585 1.3921 2.4951 3.2926 6.7330 7.1086 5.4390 13.3231 4.9607 1.1449 1.2506 4.9061 7.4150 2.0759 5.0991 13.8031 12.7105 1.4817 2.3348 8.0825 10.6177 13.3090 2.8907 1.1693 1.1677 1.6425 1.3306 1.8264 1.2704 6.6527 4.0558 4.8014 6.4781 4.7214 1.2093 1.1666 5.6215 1.0912 1.0917 1.0551 1.0563 1.0660 1.0660 1.0954 1.0952
irintensity: 0.3160 2.5159 0.2602 0.8446 3.6415 6.1624 0.2319 1.1479 91.8988 0.2400 0.6618 12.1380 114.9357 1.2818 17.5570 8.3807 9.2627 6.3636 19.1007 17.3484 6.0474 29.5407 146.8876 39.8917 5.2561 0.0458 137.4355 104.3428 188.4978 88.9018 40.4307 273.9313 60.1956 49.6604 10.6464 28.1302 85.1454 71.4659 52.1877 2.4623 0.0653 128.0529 0.8018 42.5684 51.2090 109.3509 31.6880 1.1297 20.9890 0.0095 0.3051 87.0650 90.8885 0.0447 346.9512 1.9754 416.8825 2.5078 21.2484 0.0204 251.7927 0.0981 28.9258 64.6592 130.1946 2.9885
temp: 298.150 k
press: 1.00000 atm
elementType: 16 16 8 8 8 8 8 8 7 7 6 6 6 6 6 6 1 1 1 1 1 1 1 1
symmnumber: 1
zpe: 398481.0 jmol-1
zpe.correction: 0.151773 hartree
zpe.thermalcorrener: 0.169766 hartree
zpe.thermalcorrenthalpy: 0.170710 hartree
zpe.thermalcorrgfe: 0.106282 hartree
zpe.sumelectzpe: -1588.848906 hartree
zpe.sumelectthermal: -1588.830914 hartree
zpe.sumelectthermalent: -1588.829969 hartree
zpe.sumelectthermalfe: -1588.894398 hartree
dipole: 0.0003 -0.0006 2.2344
dipole: 2.2344
quadrupole: -120.7286 -95.6014 -114.4353
quadrupole: 6.6668 0.0043 0.0053
quadrupole: -10.4735 14.6537 -4.1802 6.6668 0.0043 0.0053
hfenergy: -1589.0006793 hartree
pointgroup: C01 [X(C6H8N2O6S2)]
dipole: 0.0001102 -0.000228 0.8790726 debye
dipolederiv: 2.1533626 -0.2841404 -0.0943944 -0.1936645 1.2173452 0.0085663 -0.4041756 0.126578 1.6429265 2.153253 -0.284133 0.0944221 -0.1936962 1.2173257 -0.0086512 0.4040953 -0.1266756 1.6428648 -0.5723896 0.0367438 0.2253321 -0.0047592 -0.5149351 -0.0156655 0.5234037 -0.1288422 -0.9967815 -0.5724797 0.0366678 -0.2253517 -0.0047645 -0.5149325 0.0157879 -0.5236688 0.1289708 -0.9967903 -0.6763851 0.0827867 -0.0063203 0.1599842 -0.606258 0.1065053 -0.0106657 0.0319123 -0.4877655 -0.7400611 -0.0291474 -0.031882 -0.0976128 -0.5839099 -0.1175427 -0.002884 -0.0440744 -0.516963 -0.6763347 0.0827758 0.006333 0.1599871 -0.6062342 -0.1065039 0.0107638 -0.0319263 -0.4877667 -0.7400343 -0.0291645 0.0318289 -0.0976849 -0.5838999 0.1174738 0.0030469 0.0439918 -0.5168559 -0.588154 -0.6621686 0.0252186 -0.5952629 -1.0845004 -0.0464185 0.0550252 0.0431412 -0.6129761 -0.5880484 -0.662136 -0.0251969 -0.595181 -1.0845085 0.0462039 -0.0550153 -0.0432369 -0.6129973 -0.3140848 0.3574956 -0.0063215 -0.5076439 0.0274636 -0.0410729 -0.1681592 0.0368828 -0.1760701 -0.314016 0.357468 0.0063471 -0.5075738 0.0274426 0.0410351 0.1681696 -0.0368569 -0.1760535 -0.0336641 1.0976027 0.0070183 0.5566218 0.8742078 0.0525507 -0.0758934 0.0612426 0.1217422 -0.0337067 1.0976528 -0.0067532 0.5566375 0.874239 -0.0522134 0.0761455 -0.0607467 0.1217304 0.0841998 -0.6952782 0.0147547 0.6155854 -0.2522052 0.0045175 0.039404 0.0123817 -0.1042122 0.0841298 -0.6952374 -0.0148853 0.6155548 -0.2521823 -0.0045104 -0.0393778 -0.0125438 -0.1042348 0.1154037 0.0264046 -0.0085626 -0.0095338 0.0511049 0.0013733 -0.0319572 0.0250838 0.1623947 0.1153903 0.0264047 0.0085682 -0.0095491 0.0511084 -0.0014076 0.0319985 -0.0251387 0.162394 0.3209595 -0.0103114 -0.0307859 -0.0146239 0.2613615 0.0223561 -0.0007656 -0.0630632 0.3323123 0.1348547 0.0459459 -0.012384 0.0601117 0.2730638 0.0042987 -0.0265017 -0.002764 0.3657257 0.3208956 -0.0103214 0.0307 -0.0146018 0.2613368 -0.0223089 0.0005842 0.0630635 0.3322817 0.1348504 0.0459114 0.0123096 0.0600858 0.2730786 -0.0043358 0.0264357 0.0026254 0.3657506 0.1160115 0.0340437 -0.0940624 0.0307467 0.3372546 0.0170006 0.0266648 -0.0163733 0.2696729 0.1160478 0.0341348 0.0940673 0.0308372 0.3372334 -0.0170386 -0.0266726 0.0163681 0.269671 unknown
polarizability: 228.8198193|-2.3477936|171.901453|0.0049564|0.0078365|97.4546063 unknown
InChI: InChI=1S/C6H8N2O6S2/c7-3-1-5(15(9,10)11)4(8)2-6(3)16(12,13)14/h1-2,9,12H,7-8H2
charge 0 multiplicity 1
24 atoms
S  -3.199954 0.368372 -0.002938
S  3.199969 -0.368333 -0.002932
O  -3.360176 0.335494 1.847862
O  3.360318 -0.335605 1.847861
O  -3.5838 1.84624 -0.528428
O  -3.988124 -0.929391 -0.592251
O  3.58382 -1.846164 -0.528536
O  3.98803 0.929468 -0.592288
N  -1.590734 -2.376211 -0.106595
N  1.590779 2.37623 -0.105767
C  -1.358154 0.099974 -0.061092
C  1.358165 -0.099949 -0.060967
C  -0.823941 -1.22675 -0.077427
C  0.823955 1.226774 -0.077118
C  -0.598726 1.276426 -0.072218
C  0.598739 -1.276403 -0.072355
H  -1.112637 2.244119 -0.089029
H  1.11265 -2.244092 -0.089369
H  -2.604284 -2.311579 -0.244171
H  -1.140571 -3.286871 -0.089356
H  2.604428 2.311598 -0.242647
H  1.14065 3.286905 -0.088337
H  -4.328828 0.463773 2.070485
H  4.328927 -0.464326 2.070414
