program: Gaussian 09
title: 000078656
version: EM64L-G09RevD.01
frameworkgroup: C1[X(C7H12O3)]
method: RPBEPBE
basis: SDD
operation: Freq
keyword: #pfreq=noraman
keyword: PBEPBE/SDD
title: #p freq=noraman PBEPBE/SDD
converged: YES YES NO NO
title: Mulliken charges:
elementType: O O O C C C C C C C H H H H H H H H H H H H
charge: -0.253006 -0.195794 -0.249985 -0.595752 -0.465712 0.226381 0.276153 -0.673023 -0.230354 -0.670632 0.274750 0.238315 0.224248 0.280907 0.229725 0.228419 0.213113 0.232961 0.230289 0.213108 0.230660 0.235228
chargesum: 0.00000
title: Mulliken charges with hydrogens summed into heavy atoms:
elementType: O O O C C C C C C C
charge: -0.253006 -0.195794 -0.249985 -0.082687 0.039443 0.226381 0.276153 -0.001766 0.232896 0.008365
polarizability: 1.10767162e+02 -1.09236294e+00 8.07315654e+01 4.66736188e-01 -1.62853705e+00 6.83339444e+01
1716.lowfreq: -15.9696 -4.6552 0.0005 0.0007 0.0011 7.5495 19.6987 49.4531 54.8915
frequency: 16.5338 49.3960 54.8908 73.8363 115.4489 163.5291 169.2986 197.3036 235.1875 252.8955 320.5845 371.1485 409.7287 477.6912 540.5519 615.5620 696.8914 754.9925 785.2192 798.9805 824.9702 905.6525 931.7957 1003.1028 1021.2175 1052.1775 1074.2893 1098.9293 1114.5646 1134.2140 1135.2283 1204.6237 1246.3837 1248.6151 1278.4336 1345.5038 1356.6575 1397.8056 1401.7799 1432.2328 1441.6197 1463.0243 1471.2696 1473.4102 1479.3394 1485.9648 1618.4911 1643.4898 2961.5512 2998.0909 2998.5472 3009.2351 3013.6351 3017.0074 3073.0091 3094.6282 3095.4669 3099.2416 3110.7359 3124.5922
redmass: 4.0174 5.1618 2.3094 2.5218 2.3549 2.1526 2.0762 1.6760 3.1612 1.4319 5.2932 3.4170 2.3273 2.8784 4.3988 3.7223 3.2369 2.7869 2.4243 1.1008 2.3461 2.9205 2.7528 1.8959 2.1365 2.1470 1.7612 2.1735 2.2302 1.5850 2.6924 1.4804 1.2719 1.1473 1.4737 1.8071 1.4120 1.2115 1.2608 1.0916 1.0949 1.0398 1.0397 1.0643 1.0499 1.0665 9.4885 8.1957 1.0631 1.0359 1.0360 1.0935 1.0582 1.0641 1.1067 1.0985 1.1004 1.0998 1.1027 1.0991
irintensity: 2.2051 5.0165 0.7191 1.2815 0.4300 4.6736 3.7842 1.9503 9.6616 2.4579 4.5640 12.7109 1.3795 0.6252 8.0884 8.6029 2.6693 5.8581 3.3485 4.4515 12.7165 22.7249 2.3674 32.4580 43.8742 61.2593 3.6066 68.3378 3.4994 71.5992 330.7544 33.6549 29.2662 3.5252 148.1205 38.4364 3.6052 18.6912 22.0712 26.3767 36.1927 12.2214 12.4430 4.2556 12.1426 15.0213 241.7576 71.3812 14.0051 24.3404 22.1461 1.4937 16.3674 5.0780 7.2390 26.9490 28.2305 26.2897 41.6059 2.5805
temp: 298.150 k
press: 1.00000 atm
elementType: 8 8 8 6 6 6 6 6 6 6 1 1 1 1 1 1 1 1 1 1 1 1
symmnumber: 1
zpe: 472406.5 jmol-1
zpe.correction: 0.179930 hartree
zpe.thermalcorrener: 0.192125 hartree
zpe.thermalcorrenthalpy: 0.193069 hartree
zpe.thermalcorrgfe: 0.139463 hartree
zpe.sumelectzpe: -498.815878 hartree
zpe.sumelectthermal: -498.803683 hartree
zpe.sumelectthermalent: -498.802739 hartree
zpe.sumelectthermalfe: -498.856345 hartree
dipole: -1.7994 -1.1491 1.3470
dipole: 2.5244
quadrupole: -50.1454 -69.7444 -57.0549
quadrupole: -3.9329 4.9963 2.1628
quadrupole: 8.8361 -10.7628 1.9266 -3.9329 4.9963 2.1628
hfenergy: -498.995808 hartree
pointgroup: C01 [X(C7H12O3)]
dipole: -0.6808802 -0.2501299 -0.6784007 debye
dipolederiv: -1.6709913 0.2098576 0.2168159 0.3147444 -0.4127366 0.0793278 0.3742951 0.0421645 -0.4220471 -0.5936155 -0.0708433 -0.0574109 -0.1985105 -0.2971247 -0.0433419 -0.2408118 0.042221 -0.9035918 -0.7391214 0.0807194 0.041332 -0.0527932 -0.5342989 0.3583941 0.2474115 0.1998799 -0.7026794 -0.8592249 0.0547688 -0.3156566 0.0309095 -0.1214303 0.0726751 -0.2606174 0.0479827 -0.1093715 -0.1916639 -0.0940008 0.1164575 -0.1000381 0.0816073 0.0651446 0.1747073 0.1079389 -0.2786578 1.1919851 0.265932 0.097971 0.5975482 0.1473007 0.0901992 0.2181705 -0.0289103 1.0393654 1.8400264 -0.3080238 -0.2073291 -0.3516063 0.6079022 -0.5803121 -0.5706344 -0.3099967 0.8206031 -0.0130578 -0.0488889 -0.0353889 -0.0456839 0.0389056 -0.0256364 -0.0104962 -0.027725 0.0692201 0.8314452 -0.1536246 -0.00539 -0.3059563 0.3906537 0.0617179 0.1118046 0.0333312 0.2975536 -0.1207675 0.0082418 0.0651647 0.0301889 0.0518327 0.0089744 0.0550104 0.0053902 0.0153055 0.035845 -0.0544727 0.0308599 -0.0551034 0.0611234 0.0315628 0.0315037 0.0660222 0.0266623 0.097889 0.0543237 0.0518219 0.0473928 0.0527578 -0.047047 0.0445065 -0.0799137 0.0111133 0.0499133 -0.0076856 0.0468996 -0.0005811 -0.0864862 -0.1081909 0.0022184 -0.0883265 0.0678173 0.0986977 0.024883 -0.0476836 -0.0046596 0.0704793 0.0568233 -0.0686691 0.016385 0.071021 0.0290683 0.0362759 -0.0618399 0.0743851 0.011652 0.0887725 -0.1259793 0.0662566 -0.0008265 0.0540663 0.0818026 0.0371509 0.0387248 -0.0710259 -0.0800327 0.0019425 -0.1045227 0.0474926 -0.0557575 -0.0682384 0.0964903 -0.0761997 0.0719106 0.0369772 0.1402943 0.0576896 -0.0377755 -0.0648034 -0.0752707 -0.0028852 0.0203762 -0.1071519 -0.0128467 -0.0405516 -0.0140644 0.0670366 -0.0182009 0.0315989 0.0167901 0.0640865 0.0419023 -0.0538343 -0.060997 -0.0092226 -0.1202298 -0.0711035 0.1072792 -0.0285675 0.1267441 0.0058059 0.0513874 -0.038752 0.0590872 0.0802105 0.0778243 -0.0571375 0.0032686 -0.1174044 -0.1044997 -0.0223756 0.0151316 -0.0444028 0.0845826 0.0915471 -0.0174964 -0.0588707 -0.0365641 0.100921 -0.0283387 0.0005124 -0.0372643 -0.1228047 unknown
polarizability: 110.7182884|-1.8058336|69.4379285|0.5410854|-3.8074821|79.6764545 unknown
InChI: InChI=1S/C7H12O3/c1-3-6(8)5-7(9)10-4-2/h3-5H2,1-2H3
charge 0 multiplicity 1
22 atoms
O  -1.831077 -0.681047 0.101851
O  1.794352 -0.858306 1.861948
O  -0.336786 0.160343 -1.476617
C  0.361383 -1.654311 0.059319
C  2.644323 -0.474845 -0.405434
C  1.635439 -0.972753 0.621115
C  -0.599599 -0.632866 -0.540231
C  3.810905 0.32211 0.200592
C  -2.866822 0.29138 -0.381975
C  -4.121536 0.040638 0.446504
H  -0.140336 -2.208566 0.865659
H  0.654806 -2.347989 -0.750994
H  3.017524 -1.365147 -0.956443
H  2.085861 0.113509 -1.162192
H  4.356025 -0.278179 0.949002
H  3.443557 1.227657 0.713533
H  4.519197 0.631724 -0.587978
H  -2.465092 1.312106 -0.250366
H  -3.0239 0.118098 -1.461805
H  -4.919621 0.738655 0.134455
H  -4.487992 -0.990611 0.30717
H  -3.922711 0.1980 1.520088
