program: Gaussian 09
title: 000081647
version: EM64L-G09RevD.01
frameworkgroup: C1[X(C19H28O)]
method: RPBEPBE
basis: SDD
operation: Freq
keyword: #pfreq=noraman
keyword: PBEPBE/SDD
title: #p freq=noraman PBEPBE/SDD
converged: NO YES NO NO
title: Mulliken charges:
elementType: O C C C C C C C C C C C C C C C C C C C H H H H H H H H H H H H H H H H H H H H H H H H H H H H
charge: -0.423040 -0.185227 -0.209801 -0.445434 -0.440893 -0.443219 -0.445142 0.395277 0.436401 -0.413748 -0.399180 -0.400808 -0.401185 -0.388260 -0.383182 -0.189122 -0.583456 -0.613283 0.463298 -0.840012 0.159470 0.255281 0.215586 0.185612 0.211811 0.223723 0.215640 0.194313 0.188714 0.213007 0.191651 0.202537 0.187074 0.205524 0.194463 0.196306 0.195812 0.194093 0.193309 0.201342 0.185492 0.196373 0.238753 0.237512 0.352230 0.230543 0.221306 0.222541
chargesum: 0.00000
title: Mulliken charges with hydrogens summed into heavy atoms:
elementType: O C C C C C C C C C C C C C C C C C C C
charge: -0.070811 -0.025756 0.045480 -0.044236 -0.005359 -0.033266 -0.043421 0.395277 0.436401 -0.019561 -0.006582 -0.010040 -0.011280 0.006391 -0.001317 -0.189122 -0.344703 -0.375772 0.463298 -0.165622
polarizability: 2.62493855e+02 3.13187244e-02 2.06515676e+02 2.21692460e+00 -3.67462400e+00 1.50988770e+02
1716.lowfreq: -10.7033 -7.3010 -0.0004 0.0004 0.0007 5.7356 16.9980 19.2727 31.2488
frequency: 16.6946 17.6195 31.0934 54.0073 66.3346 92.9493 102.3934 134.7427 178.3788 196.8376 210.4090 224.4973 225.7144 249.3229 265.0440 287.7551 325.1373 331.4781 332.5012 356.2210 391.2440 422.8474 429.5390 434.9464 444.4550 458.5716 484.0987 488.2139 570.2587 578.3955 590.3338 639.7412 681.1587 764.3855 772.2579 780.3951 783.7818 786.5893 798.2255 840.6928 848.8279 864.4880 877.1387 882.9506 890.5530 892.0951 902.3141 919.9008 922.7219 942.5652 955.3492 991.1351 1013.6480 1033.4111 1046.3898 1047.3145 1048.6455 1054.1897 1056.8436 1071.0363 1072.0580 1109.5254 1112.5558 1117.2862 1132.8231 1143.9779 1168.3399 1180.3287 1183.1399 1210.8373 1227.2120 1235.7179 1256.3460 1258.6428 1261.0389 1262.8214 1269.7160 1281.3821 1300.8416 1306.7422 1316.0051 1317.3779 1322.6217 1333.0867 1334.7601 1335.0852 1339.9169 1340.7846 1344.7910 1346.6692 1357.8611 1360.2413 1389.5941 1397.4393 1429.2201 1455.0582 1459.1313 1460.0907 1460.9971 1462.9474 1463.3488 1464.8696 1468.7047 1469.4139 1472.8645 1475.6228 1478.0060 1481.2279 1606.6788 1618.4138 2854.2237 2960.7083 2961.4127 2962.3473 2962.4289 2964.2074 2965.0949 2966.9875 2967.0186 2968.5124 2970.1283 2975.3929 3008.0117 3021.6278 3022.8770 3024.7672 3027.7695 3031.0941 3031.6499 3032.3186 3035.5432 3043.7771 3044.5665 3047.3941 3077.0516 3115.0732 3132.3330 3570.8607
redmass: 1.2872 1.9496 3.0055 4.0335 3.4242 3.4732 3.3120 4.3146 2.8821 2.7443 3.7359 2.0232 1.7927 3.7720 3.4545 2.9790 1.5977 1.4642 1.7080 2.7537 4.7121 2.6432 3.0090 3.0935 2.6876 4.3019 1.6729 1.7345 3.2574 3.3503 4.3974 3.9427 3.2302 4.4101 3.7225 2.4215 1.5096 1.4778 2.9995 2.3521 1.8994 1.5262 1.6672 1.6855 1.7960 1.4688 1.3722 1.9081 1.8653 2.5928 3.2211 1.6626 2.9541 1.8418 1.5366 1.8142 1.7589 1.4620 1.2567 1.2234 1.3649 2.3578 2.4983 2.6557 2.1142 2.6240 1.5001 1.4864 1.5567 1.5581 1.4263 1.4180 1.3039 1.2867 1.3004 1.4018 1.3565 1.2747 1.6012 1.2975 1.6246 1.4910 1.6216 1.3333 1.3323 1.3656 1.4671 1.4764 1.4805 1.4833 1.5326 1.7207 3.5023 1.2323 2.7820 1.9228 1.2064 1.1109 1.1233 1.0926 1.0888 1.1619 1.0842 1.0852 1.0527 1.1049 1.1084 1.1892 6.3479 6.3376 1.0804 1.0639 1.0608 1.0623 1.0635 1.0610 1.0629 1.0645 1.0629 1.0388 1.0611 1.0616 1.0840 1.0976 1.0946 1.0965 1.0949 1.1007 1.1010 1.1025 1.1024 1.1034 1.1013 1.0952 1.0993 1.0908 1.0904 1.0650
irintensity: 0.3519 0.1915 0.0049 0.3552 0.1552 1.0453 0.2228 0.0673 0.4437 0.8151 0.2425 0.0773 0.2397 3.8372 2.9268 4.4969 28.1433 51.0101 10.0599 5.7139 1.1772 3.4003 0.5806 0.8074 1.5121 1.3842 0.7603 2.2001 5.3384 7.4765 2.2699 2.5029 4.7476 12.4528 2.8951 1.0849 0.1386 0.5201 1.0983 11.6822 4.3571 22.9601 9.7679 3.2035 4.3187 7.6707 0.5300 1.0636 0.1810 14.9034 1.5839 23.2807 7.3873 4.3948 12.3297 1.4814 0.4370 0.4511 1.8788 0.1318 1.2938 6.7153 0.0342 25.4087 19.6724 19.1405 66.1353 0.8548 24.4710 0.5183 1.4298 6.3417 1.8711 1.4217 1.1725 14.4129 12.3360 1.1547 2.6538 0.1894 2.1689 16.5212 2.5091 0.2265 0.1141 0.1917 0.3618 0.9666 0.5503 1.5046 1.3879 8.9285 9.6491 7.0481 2.7810 58.8024 4.7607 3.9282 9.0083 10.4379 9.9226 6.4369 18.6721 20.9217 12.3440 3.9137 6.2263 11.6584 2.4719 2.0360 35.5237 32.1191 31.4016 10.7312 68.2764 34.9944 59.6342 14.8939 23.0493 48.4594 19.4280 23.3295 20.8752 87.7093 81.8190 80.7415 79.0625 14.0859 5.5250 7.3444 6.7064 82.5519 137.6436 27.0569 19.2903 23.4571 13.7083 23.5569
temp: 298.150 k
press: 1.00000 atm
elementType: 8 6 6 6 6 6 6 6 6 6 6 6 6 6 6 6 6 6 6 6 1 1 1 1 1 1 1 1 1 1 1 1 1 1 1 1 1 1 1 1 1 1 1 1 1 1 1 1
symmnumber: 1
zpe: 1115518.4 jmol-1
zpe.correction: 0.424879 hartree
zpe.thermalcorrener: 0.444767 hartree
zpe.thermalcorrenthalpy: 0.445712 hartree
zpe.thermalcorrgfe: 0.374647 hartree
zpe.sumelectzpe: -814.522529 hartree
zpe.sumelectthermal: -814.502640 hartree
zpe.sumelectthermalent: -814.501696 hartree
zpe.sumelectthermalfe: -814.572761 hartree
dipole: 1.9867 0.1256 0.0429
dipole: 1.9911
quadrupole: -114.1091 -118.9521 -124.7925
quadrupole: -3.1092 1.1660 -1.8864
quadrupole: 5.1755 0.3325 -5.5080 -3.1092 1.1660 -1.8864
hfenergy: -814.9474077 hartree
pointgroup: C01 [X(C19H28O1)]
dipole: -0.7816723 -0.047232 0.0207065 debye
polarizability: 262.4935359|-0.1933314|206.7490763|-2.2135498|-0.7089885|150.7556894 unknown
InChI: InChI=1S/C19H28O/c1-14-12-17(15-8-4-2-5-9-15)19(20)18(13-14)16-10-6-3-7-11-16/h12-13,15-16,20H,2-11H2,1H3
charge 0 multiplicity 1
48 atoms
O  -0.019258 1.729584 0.441149
C  -2.59616 0.347761 0.331593
C  2.516806 0.494765 0.152987
C  -3.797209 -0.514322 0.798217
C  -2.947196 1.040231 -1.024901
C  3.177851 0.540882 -1.257745
C  3.537218 -0.031035 1.202529
C  -1.26558 -0.404057 0.236963
C  1.222218 -0.313982 0.133327
C  -5.082512 0.337528 0.924606
C  -4.234746 1.890697 -0.917316
C  4.470736 1.389901 -1.250919
C  4.827613 0.822617 1.211126
C  -5.426388 1.044904 -0.408471
C  5.477138 0.878241 -0.192561
C  -0.038008 0.320988 0.275834
C  -1.194869 -1.804543 0.05352
C  1.229149 -1.717139 -0.058546
C  0.040201 -2.482048 -0.094303
C  0.083266 -3.991991 -0.263582
H  -2.502393 1.157432 1.099098
H  2.258949 1.534821 0.42922
H  -3.559548 -1.005622 1.761362
H  -3.978758 -1.32056 0.058585
H  -3.087582 0.246479 -1.786159
H  -2.099514 1.660676 -1.375401
H  2.453765 0.946051 -1.990631
H  3.416285 -0.493692 -1.581961
H  3.802555 -1.083519 0.971483
H  3.069122 -0.03314 2.205949
H  -4.941336 1.101013 1.718281
H  -5.927297 -0.302096 1.245946
H  -4.062426 2.735263 -0.216862
H  -4.474236 2.337746 -1.901535
H  4.210406 2.444926 -1.024836
H  4.93444 1.382707 -2.257033
H  5.545775 0.416289 1.950388
H  4.58034 1.854145 1.537946
H  -5.679765 0.279739 -1.171324
H  -6.323284 1.68206 -0.283442
H  5.817391 -0.139784 -0.476484
H  6.377031 1.523933 -0.174197
H  -2.122536 -2.387196 0.025427
H  2.192801 -2.227848 -0.180058
H  -0.931396 2.06193 0.630927
H  0.030188 -4.510628 0.714102
H  -0.764203 -4.357091 -0.871823
H  1.017258 -4.316522 -0.755575
