program: Gaussian 09
title: 000078670
version: EM64L-G09RevD.01
frameworkgroup: C1[X(C12H17NO)]
method: RPBEPBE
basis: SDD
operation: Freq
keyword: #p
keyword: freq=noraman
keyword: PBEPBE/SDD
title: #p freq=noraman PBEPBE/SDD
converged: YES YES NO NO
title: Mulliken charges:
elementType: O N C C C C C C C C C C C C H H H H H H H H H H H H H H H H H
charge: -0.482812 -0.032380 0.166377 -0.453904 -0.455292 -0.421029 -0.421595 0.408551 -0.618305 -0.400851 -0.410923 -0.256892 -0.218039 -0.244391 0.220086 0.229165 0.229692 0.217962 0.165965 0.229493 0.229924 0.164881 0.186704 0.226890 0.227172 0.326630 0.225971 0.291052 0.222175 0.222400 0.225323
chargesum: 0.00000
title: Mulliken charges with hydrogens summed into heavy atoms:
elementType: O N C C C C C C C C C C C C
charge: -0.156182 -0.032380 0.166377 -0.004653 -0.007638 -0.025572 -0.026789 0.408551 0.022459 -0.174880 -0.119870 -0.034717 0.004361 -0.019068
polarizability: 1.82573682e+02 1.69568932e-01 1.26713597e+02 -4.70914599e-01 -4.12814085e-02 9.38032382e+01
1716.lowfreq: -4.3985 -0.0007 0.0005 0.0005 5.4869 9.0378 46.4865 65.0430 99.6697
frequency: 45.5937 64.9145 99.6016 177.7660 194.3879 210.8012 242.5380 245.7580 262.4377 275.8267 347.2668 348.5655 370.2562 406.8625 415.2423 457.3628 498.9461 523.5758 541.0086 617.7202 646.9643 700.3975 709.1210 744.2487 767.2187 793.3902 858.8964 884.0407 914.7196 919.0151 940.9313 981.3186 989.3117 993.2536 1000.8872 1008.3170 1029.1139 1046.4380 1066.0378 1074.0260 1093.0681 1128.6523 1129.6899 1140.3734 1156.6659 1171.6410 1175.9892 1191.7978 1211.2174 1254.9336 1283.0692 1287.9604 1301.1030 1317.7024 1324.9609 1346.8765 1367.6534 1373.2935 1382.0461 1431.7295 1431.9758 1433.7639 1442.2125 1464.0612 1469.0430 1482.2693 1482.3350 1483.6553 1590.9305 1614.0599 2772.9052 2786.8773 2854.1947 3005.6945 3008.6018 3020.7989 3028.3035 3033.4643 3072.4886 3076.5594 3079.3924 3114.9579 3124.6582 3138.4642 3157.2884 3182.0176 3555.7987
redmass: 4.0224 3.4101 3.4018 3.4602 1.0489 1.4489 4.5080 1.6690 3.0811 3.6123 3.3624 2.0949 1.9002 2.8814 2.8081 3.1552 3.4867 3.4769 3.0560 6.4059 3.3301 4.2042 1.7725 2.9965 1.8663 1.5643 1.2460 3.3726 1.7029 3.0628 1.6882 1.3553 4.9744 2.5690 1.3187 1.5723 2.2772 2.1822 1.6246 1.7475 1.4812 2.7779 2.1606 2.4088 1.6492 1.0686 1.1154 1.1576 2.0806 1.4291 1.7878 1.5158 1.5254 1.3235 1.4034 1.3376 1.6912 1.4555 7.2283 1.0916 1.1924 2.1907 1.1074 1.0495 1.0711 1.0678 1.1902 1.9365 6.2246 6.1111 1.0715 1.0692 1.0569 1.0609 1.0621 1.0722 1.0838 1.0851 1.1028 1.1027 1.1011 1.0854 1.0875 1.0937 1.0994 1.0947 1.0652
irintensity: 0.5416 0.4092 0.2131 1.9613 104.7275 9.7853 3.2100 0.0476 2.5676 5.4053 2.4565 0.1104 4.3501 0.0987 0.5927 2.5507 6.6575 4.9197 14.1714 0.1150 5.0035 0.1603 53.8956 11.4736 50.7735 0.0106 0.1934 41.8406 1.4041 5.5252 2.5637 0.1539 3.6198 25.3175 0.5467 5.8891 5.8318 7.2764 24.6381 24.7318 18.3058 8.3202 19.1031 23.5221 48.7732 2.0261 4.1461 3.0893 15.0888 0.7178 16.7319 1.0418 12.8019 5.8026 0.3572 2.1898 33.0186 15.6372 1.4658 7.9638 5.6133 12.7288 11.3309 21.6214 1.3095 10.5329 33.2555 6.9493 0.5033 8.4391 46.7733 163.5916 174.9590 9.2219 23.4797 43.9317 64.1961 20.6469 10.4515 29.3147 32.9365 9.9088 3.8376 40.9508 30.5984 5.6193 0.9912
temp: 298.150 k
press: 1.00000 atm
elementType: 8 7 6 6 6 6 6 6 6 6 6 6 6 6 1 1 1 1 1 1 1 1 1 1 1 1 1 1 1 1 1
symmnumber: 1
zpe: 696174.4 jmol-1
zpe.correction: 0.265159 hartree
zpe.thermalcorrener: 0.278237 hartree
zpe.thermalcorrenthalpy: 0.279181 hartree
zpe.thermalcorrgfe: 0.226129 hartree
zpe.sumelectzpe: -596.366616 hartree
zpe.sumelectthermal: -596.353538 hartree
zpe.sumelectthermalent: -596.352594 hartree
zpe.sumelectthermalfe: -596.405646 hartree
dipole: 2.2900 -0.4856 0.0172
dipole: 2.3410
quadrupole: -74.5493 -84.3151 -85.8280
quadrupole: 3.5703 -0.2634 0.1724
quadrupole: 7.0148 -2.7510 -4.2638 3.5703 -0.2634 0.1724
hfenergy: -596.6317749 hartree
pointgroup: C01 [X(C12H17N1O1)]
dipole: -0.8972466 0.1481562 -0.145844 debye
polarizability: 182.5437906|-1.5797043|106.5418517|-0.2583344|-16.0218501|114.0048744 unknown
InChI: InChI=1S/C12H17NO/c1-13-9-7-12(14,8-10-13)11-5-3-2-4-6-11/h2-6,14H,7-10H2,1H3
charge 0 multiplicity 1
31 atoms
O  -0.449547 -1.266875 1.450576
N  -3.101769 0.404702 -0.420382
C  -0.312201 -0.314943 0.319879
C  -0.970275 1.042464 0.706681
C  -1.034834 -0.892833 -0.931439
C  -2.503059 0.92814 0.828233
C  -2.565183 -0.935538 -0.748166
C  1.192522 -0.152956 0.077984
C  -4.576969 0.425447 -0.387149
C  1.659168 0.680808 -0.971658
C  2.141277 -0.816647 0.894068
C  3.042407 0.847157 -1.201167
C  3.526348 -0.649567 0.665041
C  3.984213 0.18186 -0.382004
H  -0.733629 1.795596 -0.06616
H  -0.536514 1.385656 1.663793
H  -0.645359 -1.908634 -1.127529
H  -0.806056 -0.261885 -1.808743
H  -2.771508 0.279545 1.710472
H  -2.93102 1.926227 1.035702
H  -3.037373 -1.28871 -1.683398
H  -2.839021 -1.688058 0.045654
H  -5.010825 -0.231579 0.409842
H  -4.976836 0.089889 -1.360622
H  -4.931328 1.45637 -0.208931
H  -1.414814 -1.403066 1.626725
H  0.945659 1.206751 -1.618144
H  1.778009 -1.458188 1.700356
H  3.384167 1.494281 -2.017118
H  4.247783 -1.169773 1.30588
H  5.058168 0.31056 -0.558676
