program: Gaussian 09
title: 000078646
version: EM64L-G09RevD.01
frameworkgroup: C1[X(C6H9NO3)]
method: RPBEPBE
basis: SDD
operation: Freq
keyword: #pfreq=noraman
keyword: PBEPBE/SDD
title: #p freq=noraman PBEPBE/SDD
converged: NO NO NO NO
title: Mulliken charges:
elementType: O O O N C C C C C C H H H H H H H H H
charge: -0.268734 -0.239249 -0.216163 -0.355598 -0.174537 -0.444374 -0.512622 0.157491 0.228726 -0.498988 0.268858 0.245524 0.245601 0.255684 0.253755 0.327165 0.244757 0.237054 0.245650
chargesum: 0.00000
title: Mulliken charges with hydrogens summed into heavy atoms:
elementType: O O O N C C C C C C
charge: -0.268734 -0.239249 -0.216163 -0.028433 0.094320 0.046751 -0.003183 0.157491 0.228726 0.228474
polarizability: 9.81862969e+01 -5.50867177e+00 7.18247761e+01 -4.90815554e+00 3.01128932e-01 6.09982640e+01
1716.lowfreq: -15.4787 -13.7289 -10.9668 -0.0012 -0.0010 0.0005 9.0594 63.7076 88.0629
frequency: -11.9815 63.6712 88.0488 102.7121 149.6224 204.1261 280.5907 316.0379 366.4342 456.1127 495.3234 579.2616 615.8027 632.6712 682.3881 752.5255 797.6565 837.6387 873.4119 915.3445 955.4308 1006.9859 1041.7316 1108.2786 1111.7183 1126.3429 1146.9008 1156.7046 1173.1285 1231.7659 1263.0517 1277.2989 1323.0703 1339.7200 1384.6256 1420.1325 1452.2886 1454.3797 1463.1861 1479.2014 1651.9083 1676.0835 3008.5701 3018.1464 3019.7510 3039.2682 3097.1841 3112.5319 3112.9659 3155.6005 3573.9502
redmass: 5.8435 4.9103 1.0826 3.3606 2.6271 3.9483 3.2387 5.6406 5.7645 4.5957 1.6361 2.8495 3.5518 2.7702 4.9027 3.9693 3.0797 3.4718 3.2631 2.9602 3.7183 2.2690 2.0145 1.7948 1.3807 3.1653 1.4272 1.4624 1.4181 1.6746 1.9858 1.4266 1.4267 1.7035 1.8211 1.1752 1.0505 1.0852 1.0506 1.0889 9.9298 8.8409 1.0295 1.0808 1.0660 1.0669 1.0978 1.1047 1.1036 1.1052 1.0785
irintensity: 0.1142 0.3282 0.1476 0.6234 6.7365 5.1537 12.9104 16.6114 5.1434 6.2305 42.5777 20.7467 43.5721 51.1724 18.7267 13.9200 8.4028 7.8229 1.4409 4.4479 17.3893 18.5402 15.4916 8.4797 2.4517 283.8143 19.9344 57.7433 3.6267 49.6108 57.4837 4.3850 1.8220 11.4852 29.3997 13.8747 13.4897 10.7604 12.9231 9.2168 148.0463 446.0024 30.8886 19.5940 4.8288 28.1790 6.1083 18.6147 26.0091 14.1400 33.6482
temp: 298.150 k
press: 1.00000 atm
elementType: 8 8 8 7 6 6 6 6 6 6 1 1 1 1 1 1 1 1 1
symmnumber: 1
zpe: 392323.0 jmol-1
zpe.correction: 0.149428 hartree
zpe.thermalcorrener: 0.158708 hartree
zpe.thermalcorrenthalpy: 0.159652 hartree
zpe.thermalcorrgfe: 0.114281 hartree
zpe.sumelectzpe: -513.700639 hartree
zpe.sumelectthermal: -513.691359 hartree
zpe.sumelectthermalent: -513.690415 hartree
zpe.sumelectthermalfe: -513.735786 hartree
dipole: -4.7808 3.0877 1.3396
dipole: 5.8467
quadrupole: -64.7714 -60.4646 -55.4991
quadrupole: 6.0081 3.3297 -4.8252
quadrupole: -4.5263 -0.2196 4.7459 6.0081 3.3297 -4.8252
hfenergy: -513.8500674 hartree
pointgroup: C01 [X(C6H9N1O3)]
dipole: 1.9127116 -1.2057288 0.423097 debye
dipolederiv: -1.4294185 0.2282478 0.0989542 0.3217165 -0.5502691 0.053159 0.1496442 0.0746018 -0.3339476 -1.1516185 0.2575773 -0.1874306 0.4462391 -0.6151783 0.0273414 -0.1434446 -0.0427808 -0.4517514 -0.6319678 -0.0673779 0.0707088 0.2065905 -0.810751 0.1503684 0.006006 0.2685339 -0.3651381 -1.0413741 0.0391688 -0.1621138 -0.0985806 -0.3547254 -0.025012 -0.4224412 0.0458167 -0.7142934 0.4444713 -0.1511351 0.0123984 -0.4551157 0.0918125 -0.059893 -0.0599061 -0.0110059 0.2337377 0.0745083 0.0015525 -0.0504442 0.0999162 0.11324 -0.0419537 0.0646546 -0.026223 0.0669153 -0.0289247 0.1421308 0.0131127 0.1381946 -0.2162639 -0.1871407 0.0294814 -0.2042996 -0.0386962 1.6041879 -0.37004 0.479844 -0.27278 0.6917513 0.269565 0.6626668 0.218927 0.7038892 1.4372203 -0.138806 -0.1345807 -0.4765572 1.0259179 -0.2386923 -0.0990162 -0.40657 0.2877635 0.6024762 0.0065061 -0.0705226 0.0906088 0.2235163 0.0070652 -0.1509722 0.0194473 0.286338 -0.0479121 0.0169872 -0.0600303 0.0532993 0.0704818 0.0433649 -0.0664428 0.0377219 -0.0634036 0.0248885 -0.0731763 0.0304566 -0.0618941 -0.0410041 0.0857814 0.0052798 0.1091803 -0.0229226 -0.0228436 0.1009449 0.061919 0.0746916 0.0564458 -0.0349369 0.0765126 -0.047095 0.0294714 -0.0357115 -0.0953181 -0.0360708 -0.0766956 0.0210407 -0.0223701 -0.0333611 0.0002042 0.1044212 0.0636823 0.0126778 0.0572819 0.0070711 0.0582751 0.0643451 0.0168729 0.0482211 -0.060953 0.1711854 0.0277074 -0.0862468 0.0568565 0.1781789 -0.0757704 -0.0792786 -0.0466042 0.3026458 0.0083909 0.0005881 -0.0550422 -0.0512437 0.0963945 0.0364407 0.0412342 0.0150111 -0.1074763 -0.0426142 0.0770437 0.0009174 0.1211588 0.0026803 0.0240484 -0.0096961 0.03476 0.109572 0.0013738 -0.015279 0.0168891 -0.1234761 -0.0415432 -0.0757103 0.0122065 -0.0878469 0.0338283 unknown
polarizability: 98.5596103|-5.2543635|71.6153136|3.8687556|0.4800465|60.8344132 unknown
InChI: InChI=1S/C6H9NO3/c1-10-6(9)4-2-3-5(8)7-4/h4,7H,2-3H2,1H3
charge 0 multiplicity 1
19 atoms
O  2.363577 -0.448241 0.174485
O  -3.201757 0.832527 -0.214396
O  1.215035 1.489701 -0.43281
N  -1.133432 0.510638 0.875727
C  0.053251 -0.337853 0.810702
C  -0.464908 -1.596178 0.022067
C  -1.661087 -1.063737 -0.800799
C  -2.135712 0.18902 -0.041174
C  1.229676 0.363172 0.105032
C  3.592097 0.105289 -0.454741
H  0.410654 -0.635653 1.813381
H  -0.806574 -2.349542 0.75193
H  0.335134 -2.047044 -0.584235
H  -2.489037 -1.783102 -0.896963
H  -1.368627 -0.752343 -1.820817
H  -1.156125 1.396893 1.381525
H  3.418923 0.287785 -1.528198
H  4.357397 -0.66703 -0.298923
H  3.873216 1.0525 0.034507
