program: Gaussian 09
title: 000081573
version: EM64L-G09RevD.01
frameworkgroup: C1[X(C18H30O2)]
method: RPBEPBE
basis: SDD
operation: Freq
keyword: #pfreq=noraman
keyword: PBEPBE/SDD
title: #p freq=noraman PBEPBE/SDD
converged: YES YES NO NO
title: Mulliken charges:
elementType: O O C C C C C C C C C C C C C C C C C C H H H H H H H H H H H H H H H H H H H H H H H H H H H H H H
charge: -0.314151 -0.243074 0.321867 -0.429206 -0.482682 -0.773407 -0.323913 0.441845 -0.064801 -0.532166 -0.471433 -0.837203 0.293099 -0.582372 -0.285935 -0.492879 0.399441 -0.659481 -0.788504 -0.789633 0.211779 0.222513 0.213257 0.225888 0.213272 0.273770 0.223263 0.211303 0.231389 0.214426 0.192451 0.202957 0.206049 0.234313 0.223592 0.219330 0.208205 0.219627 0.211983 0.236947 0.238311 0.231071 0.226817 0.212408 0.212691 0.226779 0.215413 0.221492 0.217528 0.215763
chargesum: 0.00000
title: Mulliken charges with hydrogens summed into heavy atoms:
elementType: O O C C C C C C C C C C C C C C C C C C
charge: -0.314151 -0.243074 0.321867 0.005087 -0.043537 -0.063102 -0.112610 0.441845 0.166588 -0.125290 -0.062427 -0.159968 0.293099 -0.150761 -0.077730 -0.017621 0.399441 0.010816 -0.133622 -0.134850
polarizability: 2.18873291e+02 1.63391145e+01 2.10194201e+02 5.15764671e+00 -5.02226428e+00 1.79828645e+02
1716.lowfreq: -22.4753 -8.1391 -5.5854 -0.0006 -0.0005 -0.0004 3.0354 8.6568 13.6913
frequency: -20.7843 7.8787 13.2696 18.4157 20.3822 34.7832 45.8970 54.1656 73.5941 78.9884 88.5092 104.6022 112.1364 134.7698 149.5168 180.2332 184.1758 188.9556 223.3677 231.2342 243.9663 275.5614 285.3137 291.4264 296.3312 315.4532 333.6545 351.9832 365.2224 390.5382 404.2587 438.0957 442.0847 470.5763 498.7768 518.2710 542.3582 549.9253 565.6299 629.5729 697.9920 710.9873 729.4326 761.5433 787.6698 793.7447 826.0947 834.7426 852.4953 855.4685 887.7878 924.3642 928.2761 937.9970 947.3597 975.6400 979.2402 986.2529 993.5783 1001.4246 1009.5489 1014.6066 1037.7643 1040.2815 1050.7081 1068.3024 1079.1079 1081.1912 1082.4788 1101.1262 1120.7879 1128.1958 1150.5548 1170.2042 1187.9271 1202.9396 1207.2404 1231.9902 1239.0554 1242.1879 1277.8545 1293.2539 1295.0755 1297.0318 1325.9782 1332.0467 1340.5706 1357.5424 1365.7536 1379.3608 1386.9059 1392.4310 1396.4373 1398.0858 1422.3105 1442.1673 1444.3817 1454.2157 1455.8173 1459.3809 1464.8590 1469.1485 1470.2097 1470.7531 1471.4155 1473.2578 1480.0379 1480.1605 1483.5167 1489.6708 1642.4042 1657.4700 1687.4703 1697.9191 2953.1556 2957.8214 2960.3431 2962.9305 2974.6828 2980.4744 2987.7100 2995.4072 2995.6620 2999.3770 3023.0084 3023.8018 3027.2174 3029.4929 3038.4571 3042.6084 3043.8207 3059.1970 3066.5958 3076.7377 3078.0781 3085.4269 3092.1260 3092.6562 3094.8361 3095.0778 3102.9343 3109.1656 3119.6308 3203.8170
redmass: 2.3431 3.4094 3.4117 1.8267 3.7655 2.8922 4.2620 2.8698 3.1944 3.1993 3.6247 1.2496 1.1685 2.2181 3.0635 2.0197 1.3441 1.3837 2.2932 1.1313 3.4139 2.0858 2.6985 3.1641 2.4532 2.3486 3.2250 3.1288 2.5261 2.3107 2.3789 2.6125 2.6966 2.2260 2.5379 2.6038 2.5081 2.4841 2.7198 3.0938 2.3200 4.2117 1.9770 1.9798 2.5395 1.3553 1.8946 1.3359 1.8482 4.1296 1.8591 1.8427 1.7990 1.3501 1.3884 1.5698 1.8533 2.0418 1.2642 1.6281 1.4529 1.5349 1.5447 1.8608 2.4193 2.1057 2.0692 1.7041 1.6249 2.0409 2.1097 2.2737 1.6374 1.7694 2.9008 1.1888 2.0840 2.0925 1.6936 1.1813 1.4310 1.2643 1.3490 1.2637 1.4061 1.7927 1.4849 1.4210 1.3923 1.2231 1.3201 1.3143 1.2370 1.2141 1.1775 1.0791 1.0859 1.0552 1.0749 1.0662 1.0744 1.0793 1.0394 1.0699 1.0635 1.0559 1.0736 1.0541 1.0557 1.0870 9.3527 4.7953 6.8371 6.5370 1.0376 1.0606 1.0392 1.0399 1.0637 1.0602 1.0610 1.0520 1.0394 1.0434 1.0996 1.0968 1.0960 1.0963 1.0976 1.0943 1.0986 1.0963 1.0924 1.0950 1.0952 1.0982 1.0952 1.0953 1.0674 1.1001 1.1003 1.0858 1.1001 1.1142
irintensity: 0.0274 0.0079 0.1018 0.3459 0.1779 0.2806 2.2707 0.5692 1.2814 1.0754 0.0431 0.0555 0.6025 2.0024 1.8561 0.1572 1.3025 0.6044 0.8684 0.2419 4.2989 1.5395 2.9414 3.6470 1.6986 0.3523 8.3738 1.7615 0.9119 0.9075 1.9117 6.5857 1.2342 2.5420 2.3408 6.1114 4.0381 0.5812 7.4800 1.7746 9.0580 14.6817 1.0394 0.6161 1.0474 14.6510 25.2954 22.3809 14.3262 27.9784 8.7405 3.4953 2.3373 64.1979 0.4731 4.0073 8.0327 2.6142 4.2832 2.1880 44.5975 6.8119 1.4656 6.5256 6.8268 210.6095 25.2021 2.1222 0.2574 102.9587 49.7452 136.0155 5.4236 9.4126 4.1470 0.2964 7.0439 5.8294 7.5688 0.1963 5.3945 0.8221 1.3647 2.8438 0.1905 46.1673 1.4852 0.4356 2.8733 28.3733 17.9060 27.5424 10.8917 19.4598 25.6045 2.3528 25.8210 2.1157 5.0228 3.2634 4.4248 17.4140 11.9618 16.6820 2.9325 20.9110 25.6471 7.9761 8.4706 12.2991 172.9798 5.7709 2.6708 2.5282 35.7217 23.8597 54.9529 28.8105 99.6749 0.8880 40.2596 43.3354 24.6239 12.4199 13.2928 7.2030 76.6069 24.3531 6.1874 22.1935 5.0661 11.6468 17.0060 4.1187 87.7421 37.1200 34.6381 36.0732 16.6898 26.8259 31.7836 5.2417 10.8471 19.4703
temp: 298.150 k
press: 1.00000 atm
elementType: 8 8 6 6 6 6 6 6 6 6 6 6 6 6 6 6 6 6 6 6 1 1 1 1 1 1 1 1 1 1 1 1 1 1 1 1 1 1 1 1 1 1 1 1 1 1 1 1 1 1
symmnumber: 1
zpe: 1137883.8 jmol-1
zpe.correction: 0.433397 hartree
zpe.thermalcorrener: 0.458553 hartree
zpe.thermalcorrenthalpy: 0.459497 hartree
zpe.thermalcorrgfe: 0.373089 hartree
zpe.sumelectzpe: -852.723550 hartree
zpe.sumelectthermal: -852.698394 hartree
zpe.sumelectthermalent: -852.697450 hartree
zpe.sumelectthermalfe: -852.783858 hartree
dipole: -1.7576 -0.7544 0.2662
dipole: 1.9310
quadrupole: -138.3187 -116.0613 -121.5518
quadrupole: -5.1775 -1.0366 -2.0916
quadrupole: -13.0081 9.2493 3.7588 -5.1775 -1.0366 -2.0916
hfenergy: -853.1569468 hartree
pointgroup: C01 [X(C18H30O2)]
dipole: -0.6737281 0.3020323 -0.1790559 debye
polarizability: 217.235341|-17.3392746|208.5067729|-1.4219776|-11.0913162|183.1540226 unknown
InChI: InChI=1S/C18H30O2/c1-7-17(19)20-18(6,8-2)14-10-13-16(5)12-9-11-15(3)4/h8,11,13H,2,7,9-10,12,14H2,1,3-6H3
charge 0 multiplicity 1
50 atoms
O  2.285927 0.110385 -0.227846
O  4.494617 -0.677322 -0.338186
C  1.755537 -1.121128 0.509272
C  0.252384 -0.767582 0.694397
C  -0.041326 0.499288 1.544217
C  1.908676 -2.355684 -0.397863
C  -1.531244 0.771528 1.61128
C  -2.243449 1.707848 0.919151
C  2.474177 -1.22434 1.846446
C  -3.76056 1.779825 1.057643
C  -4.537464 1.219523 -0.184967
C  -1.626761 2.71522 -0.036397
C  3.637728 0.203469 -0.572331
C  2.823575 -2.371042 2.475595
C  -4.404474 -0.281868 -0.330303
C  3.89281 1.535858 -1.270214
C  -3.761306 -0.986949 -1.30509
C  5.344145 1.683399 -1.75974
C  -3.710349 -2.506922 -1.263489
C  -3.035831 -0.367102 -2.486695
H  -0.239673 -1.645477 1.156513
H  -0.192634 -0.633551 -0.310637
H  0.348563 0.345253 2.569812
H  0.510887 1.351407 1.111555
H  1.374118 -3.216668 0.042205
H  2.968756 -2.621363 -0.529069
H  1.460456 -2.149756 -1.385802
H  -2.098175 0.090982 2.266882
H  2.666785 -0.258758 2.336219
H  -4.08366 1.214894 1.953507
H  -4.07412 2.834356 1.207722
H  -4.204681 1.745631 -1.098008
H  -5.608574 1.477111 -0.050928
H  -0.536135 2.595864 -0.139097
H  -1.829023 3.750202 0.304854
H  -2.068231 2.625456 -1.048617
H  -4.875677 -0.860214 0.481467
H  2.666804 -3.358888 2.027943
H  3.300655 -2.350545 3.461308
H  3.628311 2.344314 -0.560968
H  3.173333 1.62648 -2.106065
H  6.054667 1.596167 -0.92032
H  5.598897 0.894375 -2.487907
H  5.488529 2.666011 -2.24294
H  -2.66195 -2.86634 -1.21977
H  -4.247439 -2.912065 -0.388199
H  -4.15776 -2.948417 -2.176535
H  -3.130106 0.730119 -2.527302
H  -3.418724 -0.778457 -3.441787
H  -1.954612 -0.61113 -2.447919
