program: Gaussian 09
title: 000078654
version: EM64L-G09RevD.01
frameworkgroup: C1[X(C9H19N)]
method: RPBEPBE
basis: SDD
operation: Freq
keyword: #pfreq=noraman
keyword: PBEPBE/SDD
title: #p freq=noraman PBEPBE/SDD
converged: YES YES NO NO
title: Mulliken charges:
elementType: N C C C C C C C C C H H H H H H H H H H H H H H H H H H H
charge: -0.068397 -0.352673 -0.365658 -0.399159 -0.391650 -0.397169 -0.327855 -0.373400 -0.346381 -0.694101 0.162531 0.209516 0.210035 0.163803 0.189842 0.204124 0.203679 0.189567 0.212014 0.187489 0.167571 0.197792 0.206779 0.192122 0.191391 0.192752 0.214934 0.208681 0.211820
chargesum: 0.00000
title: Mulliken charges with hydrogens summed into heavy atoms:
elementType: N C C C C C C C C C
charge: -0.068397 0.019374 0.008181 -0.005194 0.001595 0.002334 0.037509 0.025501 0.037762 -0.058666
polarizability: 1.25591923e+02 -2.67291778e-01 9.73192493e+01 -6.42992422e-01 4.54699199e-02 8.63239697e+01
1716.lowfreq: -0.0008 -0.0005 -0.0004 0.6443 17.8968 30.6305 43.5166 58.7851 90.0571
frequency: 43.0094 58.3187 89.9792 116.9471 174.1089 231.9253 238.4565 263.3647 288.0920 305.7985 386.4578 439.8925 453.7128 462.2033 564.8579 736.6270 753.7493 794.5468 805.5965 854.2189 856.5329 894.4931 908.8978 937.1867 960.1262 985.9426 1028.3844 1052.6323 1062.9062 1078.2675 1104.9883 1114.7773 1127.1164 1143.5197 1152.0611 1157.7871 1211.1235 1234.3378 1259.7345 1264.7082 1272.1437 1283.1135 1287.6112 1299.2256 1329.5912 1337.8283 1342.4595 1345.7512 1350.5283 1371.4921 1387.6522 1392.8162 1451.3146 1458.8430 1460.7497 1465.2140 1469.2219 1470.3676 1476.0554 1477.4693 1482.4547 1489.7785 2805.1232 2809.9264 2828.9034 2962.7859 2965.3718 2972.1543 2979.0714 2983.9441 2984.6297 2997.4224 3006.2201 3017.4207 3031.4516 3041.8663 3044.5135 3047.7879 3053.6894 3069.8238 3070.7217
redmass: 1.7169 2.6676 3.0036 2.4309 2.1203 1.2451 1.5625 3.2018 3.1765 2.0248 1.7425 2.6914 2.8047 2.8629 1.8721 1.0778 3.6007 1.1963 1.4337 1.9242 1.8008 1.9260 1.8732 1.2689 1.3063 2.7194 2.9601 2.1150 1.6354 2.1809 2.1915 1.9749 2.3413 1.6400 1.4134 2.1108 1.5770 1.5130 1.2628 1.1752 1.3862 1.2054 1.1153 1.3907 1.2729 1.4077 1.4653 1.5325 1.4948 1.3952 1.2771 1.3674 1.0902 1.0797 1.0880 1.0867 1.0737 1.0824 1.0794 1.0425 1.0804 1.0901 1.0716 1.0706 1.0695 1.0584 1.0621 1.0368 1.0606 1.0624 1.0606 1.0848 1.0996 1.0870 1.0960 1.0939 1.1030 1.0965 1.1031 1.1008 1.0994
irintensity: 0.1319 0.0877 0.1223 0.1437 1.0556 0.2422 0.6259 0.2927 0.2186 2.9922 2.8713 2.4729 0.6563 1.2876 0.2830 8.0730 9.3846 0.5035 0.0826 2.9300 7.7782 4.7574 5.9261 5.3475 2.7613 13.6540 4.9975 4.5471 16.3836 1.5330 14.5025 9.5145 7.6713 12.4420 9.1308 15.5741 5.3086 6.5547 4.6377 5.8627 3.1052 1.7256 3.5753 11.1721 6.8584 1.6925 2.6320 7.7657 1.6096 6.8071 9.1661 1.4628 6.9262 2.3758 13.9458 7.1515 3.6475 2.1444 2.3485 12.7293 2.1400 18.3789 50.0157 39.6996 235.0846 27.4970 39.0384 32.7187 40.2450 29.4153 38.4981 23.8262 3.5768 70.7937 65.7887 23.6334 29.6007 39.8518 102.8341 97.3046 55.4618
temp: 298.150 k
press: 1.00000 atm
elementType: 7 6 6 6 6 6 6 6 6 6 1 1 1 1 1 1 1 1 1 1 1 1 1 1 1 1 1 1 1
symmnumber: 1
zpe: 699647.3 jmol-1
zpe.correction: 0.266482 hartree
zpe.thermalcorrener: 0.277856 hartree
zpe.thermalcorrenthalpy: 0.278800 hartree
zpe.thermalcorrgfe: 0.228883 hartree
zpe.sumelectzpe: -408.253047 hartree
zpe.sumelectthermal: -408.241673 hartree
zpe.sumelectthermalent: -408.240729 hartree
zpe.sumelectthermalfe: -408.290645 hartree
dipole: 0.0750 -0.1041 0.7074
dipole: 0.7190
quadrupole: -63.5933 -63.3768 -65.7892
quadrupole: 0.2783 0.1036 0.3853
quadrupole: 0.6597 0.8763 -1.5361 0.2783 0.1036 0.3853
hfenergy: -408.5195286 hartree
pointgroup: C01 [X(C9H19N1)]
dipole: -0.0279057 -0.0419377 -0.2783401 debye
polarizability: 125.6012677|0.0643141|97.3163269|-0.3745461|-0.087536|86.3175478 unknown
InChI: InChI=1S/C9H19N/c1-2-3-7-10-8-5-4-6-9-10/h2-9H2,1H3
charge 0 multiplicity 1
29 atoms
N  -0.439928 -0.246837 0.108597
C  -0.85481 1.056071 -0.473492
C  -1.467032 -1.292626 -0.140567
C  -2.200954 1.529403 0.112039
C  -2.831929 -0.894223 0.457465
C  -3.299263 0.465488 -0.108132
C  0.901888 -0.683132 -0.356092
C  2.061464 0.179427 0.184368
C  3.44475 -0.401575 -0.189608
C  4.615213 0.469471 0.315597
H  -0.947671 0.980885 -1.592037
H  -0.073377 1.80641 -0.259845
H  -1.114868 -2.237674 0.314865
H  -1.593997 -1.481382 -1.241728
H  -2.486493 2.490848 -0.357243
H  -2.072426 1.709276 1.196987
H  -2.730306 -0.821861 1.557721
H  -3.574265 -1.68627 0.238968
H  -4.248104 0.779783 0.366661
H  -3.49851 0.36244 -1.195366
H  0.957651 -0.714822 -1.477914
H  1.049408 -1.723317 -0.002781
H  1.963523 0.247989 1.285527
H  1.993636 1.213572 -0.208401
H  3.512894 -0.509034 -1.291915
H  3.537884 -1.424627 0.229167
H  5.593257 0.030511 0.04503
H  4.568982 1.486028 -0.118935
H  4.583883 0.574477 1.416464
