program: Gaussian 09
title: 000082422
version: EM64L-G09RevD.01
frameworkgroup: C1[X(C20H12ClNO8S3)]
method: RPBEPBE
basis: SDD
operation: Freq
keyword: #p
keyword: freq=noraman
keyword: PBEPBE/SDD
title: #p freq=noraman PBEPBE/SDD
converged: NO YES NO NO
title: Mulliken charges:
elementType: Cl S S S O O O O O O O O N C C C C C C C C C C C C C C C C C C C C H H H H H H H H H H H H
charge: -0.008018 0.368233 0.986672 0.982354 -0.207735 -0.194017 -0.627685 -0.618923 -0.504582 -0.354647 -0.426539 -0.493892 -0.457989 0.153017 -0.327738 0.532775 -0.532695 0.074111 0.590568 0.021866 0.167146 0.299789 0.406016 -0.417425 -0.460024 -0.353684 -0.346543 -0.363573 -0.439390 -0.256902 -0.171479 -0.248324 -0.230023 0.391559 0.277282 0.251371 0.266121 0.253718 0.253748 0.236884 0.232173 0.264146 0.244106 0.389785 0.398387
chargesum: 0.00000
title: Mulliken charges with hydrogens summed into heavy atoms:
elementType: Cl S S S O O O O O O O O N C C C C C C C C C C C C C C C C C C C C
charge: -0.008018 0.368233 0.986672 0.982354 -0.207735 -0.194017 -0.237900 -0.220536 -0.504582 -0.354647 -0.426539 -0.493892 -0.066430 0.153017 -0.327738 0.532775 -0.532695 0.074111 0.590568 0.021866 0.167146 0.299789 0.406016 -0.140142 -0.208653 -0.353684 -0.080421 -0.109855 -0.185642 -0.020018 0.060694 0.015822 0.014083
polarizability: 4.86567934e+02 2.00811385e+01 3.78161468e+02 -5.29567966e+01 2.31964750e+01 2.79679744e+02
1716.lowfreq: -8.8080 -3.5444 0.0013 0.0020 0.0021 3.9200 4.2059 18.9598 23.5327
frequency: 1.6992 18.5980 23.4835 31.0778 33.4377 44.1979 52.4805 72.1580 75.6346 88.7625 99.0076 105.6584 130.4828 133.9661 154.6876 168.6508 175.4340 182.3479 191.6861 192.5609 205.8091 223.8292 226.7646 232.7713 245.8357 254.3627 263.4172 270.6006 278.1315 294.5024 301.1906 306.9769 326.0600 329.8184 376.6282 385.3517 394.3869 410.3012 423.7279 433.0262 453.3499 462.3528 470.7365 478.8701 494.6544 496.1474 511.2465 532.2938 534.3365 542.7687 566.9651 584.5798 586.4967 618.7553 642.3620 653.2809 661.5431 686.1403 703.6374 730.7655 758.2942 765.9676 767.8226 779.8372 807.9995 817.8546 823.7566 849.1577 857.3456 866.3609 872.1662 881.1942 905.4231 912.1102 924.6936 933.6307 942.0852 951.0860 962.9781 980.7424 989.7593 993.7194 999.1917 1010.6580 1034.6085 1036.8922 1067.1124 1076.3926 1080.4193 1100.5646 1112.3035 1140.3717 1161.7454 1169.4611 1197.6428 1203.7927 1235.7083 1263.7964 1289.7591 1308.3344 1330.4569 1377.2392 1389.7416 1401.1017 1417.9414 1430.4992 1433.6927 1463.2727 1488.4061 1510.4033 1546.4967 1571.1785 1582.2097 1601.1530 1615.3532 1618.0349 1628.0343 3135.9895 3140.0463 3143.3319 3151.7040 3161.5709 3163.6254 3167.5573 3175.2676 3180.7109 3316.5715 3438.5366 3481.7501
redmass: 8.5674 11.1094 8.1212 10.4598 7.8053 10.2409 12.3430 7.0523 8.4232 8.4944 6.5418 5.4652 8.8368 10.2356 13.0499 10.8321 8.1003 4.8907 6.1078 6.8667 8.3106 5.2050 3.4250 5.8157 10.5565 9.4206 5.3385 9.3037 5.9272 5.7323 6.0192 2.8126 13.9664 12.4831 1.6252 7.6043 5.9148 9.8063 5.8877 5.5237 13.5705 4.4140 8.4714 5.7630 4.0390 8.0659 9.2842 7.0350 6.0450 6.4673 15.0188 4.5258 6.5756 5.9016 7.6399 6.4063 6.5604 6.3011 7.5995 5.0070 3.3326 1.5659 1.5629 3.1707 3.1613 1.8112 2.9331 2.3442 2.7905 1.5341 7.4542 6.0781 6.3705 1.5297 7.3893 6.1172 14.9996 7.1598 1.4174 1.3573 1.3390 1.3858 6.2262 2.0736 1.3768 6.1382 4.3706 1.6187 2.3420 2.1390 2.7229 1.7170 1.3141 1.1230 1.5470 2.1135 1.9143 3.1441 1.9311 2.0112 2.8993 4.9905 3.4266 5.4541 2.9631 2.4831 2.3320 2.4746 2.6936 4.4567 8.1388 11.8385 5.9540 6.3635 9.9582 7.6941 7.5324 1.0867 1.0881 1.0877 1.0893 1.0937 1.0957 1.0982 1.1003 1.0981 1.0875 1.0648 1.0662
irintensity: 3.4898 0.3474 3.6150 2.7315 1.0402 1.5043 1.0457 1.7233 2.8910 2.6800 7.1426 2.7752 3.3161 1.2340 1.9269 4.6931 1.2017 0.3616 6.7872 12.1650 3.6501 42.1466 47.4832 3.1151 3.9904 0.4514 1.1859 8.3476 1.7143 24.9590 6.5080 28.9171 18.1919 3.3695 190.7349 4.3579 25.1222 7.4262 4.7846 19.8985 55.8005 0.8537 9.8216 6.7112 1.5177 71.0828 31.6242 8.4538 6.2759 11.7017 131.5398 1.9027 5.6472 5.1259 7.8741 15.4927 11.8385 19.5754 18.0589 37.1974 67.8968 8.9293 27.9454 10.1009 10.2435 56.7264 64.9917 73.0168 12.4852 10.4538 17.0931 53.1848 24.4321 5.8242 171.4787 139.5344 46.1640 5.2293 6.0171 1.3473 0.4535 1.0032 11.1450 0.2975 81.9515 20.2985 35.8245 127.8716 15.2414 8.8785 7.2511 3.6989 4.1922 13.5972 28.1751 7.8831 2.7967 15.1480 18.4017 4.7098 129.5359 2.0520 43.4726 13.2585 7.8474 27.2259 16.9657 39.8303 64.4531 20.5342 66.3909 225.3223 84.0694 12.3406 98.5211 29.6762 328.4665 7.1681 0.3179 4.4501 2.9457 14.9415 8.6266 9.2495 23.6349 7.5224 334.5627 39.7980 78.9088
temp: 298.150 k
press: 1.00000 atm
elementType: 17 16 16 16 8 8 8 8 8 8 8 8 7 6 6 6 6 6 6 6 6 6 6 6 6 6 6 6 6 6 6 6 6 1 1 1 1 1 1 1 1 1 1 1 1
symmnumber: 1
zpe: 738487.1 jmol-1
zpe.correction: 0.281275 hartree
zpe.thermalcorrener: 0.312803 hartree
zpe.thermalcorrenthalpy: 0.313748 hartree
zpe.thermalcorrgfe: 0.214039 hartree
zpe.sumelectzpe: -3077.605313 hartree
zpe.sumelectthermal: -3077.573785 hartree
zpe.sumelectthermalent: -3077.572841 hartree
zpe.sumelectthermalfe: -3077.672549 hartree
dipole: 2.4181 -6.8447 0.3979
dipole: 7.2702
quadrupole: -169.4898 -212.6341 -239.7123
quadrupole: -3.5982 -4.5125 14.6343
quadrupole: 37.7889 -5.3553 -32.4336 -3.5982 -4.5125 14.6343
hfenergy: -3077.8865883 hartree
pointgroup: C01 [X(C20H12Cl1N1O8S3)]
dipole: -0.7183938 -2.7515371 -0.3071181 debye
polarizability: 413.7936501|-1.9913439|381.793407|-114.6146941|-16.0854573|348.8220891 unknown
InChI: InChI=1S/C20H11ClNO6S2.HO2S/c21-13-6-3-4-10-8-9-12-16(15(10)13)29-20(18(12)24,28-30(26)27)19(25)17(23)11-5-1-2-7-14(11)22-19;1-3-2/h1-9,22,26H;1H
charge 0 multiplicity 1
45 atoms
Cl -3.894729 2.305146 1.602504
S  -1.52979 1.862694 -0.250419
S  0.994999 1.555761 -4.038517
S  0.843654 3.257703 2.07371
O  0.401374 -0.771343 -2.529958
O  0.522273 0.509972 1.883035
O  2.670998 2.290497 -3.582394
O  0.997359 4.94349 1.401672
O  0.298307 2.615985 -5.008763
O  0.079869 2.138772 -2.391587
O  1.361944 2.785597 0.140372
O  2.137655 3.012567 2.983223
N  2.485825 1.048318 -1.062989
C  1.298076 1.440444 -0.313067
C  0.001759 1.277569 -1.249844
C  -1.340276 -0.793218 -0.818852
C  -2.105796 0.132323 -0.072315
C  -0.265483 -0.204826 -1.612194
C  -3.222138 -0.316869 0.717971
C  1.290425 0.389994 0.886741
C  2.350117 -0.560412 0.607207
C  3.054848 -0.108576 -0.55841
C  -3.502242 -1.753906 0.71524
C  -1.638778 -2.189897 -0.828767
C  -2.695944 -2.656054 -0.065772
C  -4.098954 0.494245 1.515854
C  2.760284 -1.717564 1.312853
C  4.180626 -0.824015 -1.036586
C  -4.586359 -2.273937 1.487687
C  3.874488 -2.429419 0.836725
C  4.569601 -1.976852 -0.327651
C  -5.15345 -0.030448 2.2638
C  -5.397279 -1.433011 2.250929
H  2.797275 1.567473 -1.900255
H  -1.017323 -2.852274 -1.439223
H  -2.943301 -3.722535 -0.042839
H  2.216435 -2.032668 2.209074
H  4.725889 -0.494471 -1.925882
H  -4.770884 -3.353242 1.468717
H  4.221726 -3.327737 1.356126
H  5.43818 -2.545546 -0.679461
H  -5.785871 0.637594 2.854348
H  -6.224514 -1.838156 2.841886
H  2.623669 3.282808 -3.704033
H  1.384156 4.836319 0.481905
