program: Gaussian 09
title: 000078661
version: EM64L-G09RevD.01
frameworkgroup: C1[X(C14H12N2O3)]
method: RPBEPBE
basis: SDD
operation: Freq
keyword: #p
keyword: freq=noraman
keyword: PBEPBE/SDD
title: #p freq=noraman PBEPBE/SDD
converged: YES YES NO NO
title: Mulliken charges:
elementType: O O O N N C C C C C C C C C C C C C C H H H H H H H H H H H H
charge: -0.303823 -0.226579 -0.227436 -0.375657 0.011279 0.208149 0.264248 0.072401 -0.510072 0.300513 -0.333554 0.383811 -0.394574 -0.370122 -0.361112 -0.648053 -0.230554 -0.228870 -0.227362 0.325583 0.251495 0.286898 0.373055 0.269806 0.266123 0.238117 0.241697 0.237703 0.236827 0.234177 0.235887
chargesum: 0.00000
title: Mulliken charges with hydrogens summed into heavy atoms:
elementType: O O O N N C C C C C C C C C C C C C C
charge: -0.303823 -0.226579 -0.227436 -0.002602 0.011279 0.208149 0.264248 0.072401 -0.184489 0.300513 -0.082059 0.383811 -0.107677 -0.100316 -0.094989 0.069463 0.006273 0.005307 0.008525
polarizability: 2.62075089e+02 -8.55322927e+00 2.45424916e+02 -1.28157252e+01 -9.86119607e+00 9.38418698e+01
1716.lowfreq: -2.5410 -0.0008 -0.0007 -0.0004 5.4506 8.9627 41.1498 53.4271 62.4865
frequency: 41.1392 53.4236 62.4860 73.1612 84.9395 146.1532 158.0884 165.7112 184.5458 194.0820 228.5462 265.0756 295.2352 316.7144 345.1433 395.2313 406.6782 414.6000 459.7363 486.9600 509.0805 525.2816 589.7436 614.4902 628.1675 652.2962 669.6548 698.3456 711.6124 714.8629 749.6622 765.2462 799.8098 830.3991 831.2106 859.6676 865.4804 935.4267 948.6013 971.0958 988.6249 989.4511 992.9349 1004.5672 1026.9133 1061.3032 1087.0515 1095.7808 1113.6381 1115.2902 1151.7576 1171.1568 1176.0227 1191.6714 1214.3584 1257.7152 1290.0109 1318.8752 1331.7168 1348.3225 1379.7375 1381.6883 1412.4893 1432.9993 1439.8921 1456.8056 1475.5660 1478.5070 1490.5976 1526.0738 1542.6145 1583.4642 1589.6842 1607.7958 1625.9119 2964.6467 3037.0859 3108.4788 3132.0940 3141.1415 3151.6324 3161.5085 3163.3452 3171.9576 3182.3930 3184.8717 3213.7956
redmass: 6.2149 4.4557 8.4687 5.4675 4.6206 4.1599 5.4345 2.4127 1.4919 4.2442 4.9477 6.0169 4.9430 5.4847 7.4289 10.8283 2.8642 4.4288 4.3795 6.0344 3.7269 4.8790 4.5353 6.4200 7.2073 6.1056 6.1503 3.1301 2.2497 6.7986 2.5976 4.7694 2.3838 2.2641 3.9501 1.2528 1.1898 1.9582 2.6785 1.4087 3.4268 1.5461 1.3942 1.3295 2.2710 3.6511 1.6001 1.8358 1.3069 2.0550 2.8873 1.4181 1.0559 1.1472 5.0068 1.7321 2.6786 1.3681 2.0891 10.4706 3.5745 6.9833 5.6781 2.0615 1.8002 2.1716 1.0418 2.2705 1.1288 4.7632 3.7582 5.7157 2.6222 5.9895 6.9490 1.0375 1.1007 1.0973 1.0852 1.0881 1.0926 1.0964 1.0878 1.1014 1.0918 1.0964 1.0821
irintensity: 3.4207 1.2291 1.5426 0.2827 0.5513 1.3772 2.0123 1.7590 0.3879 5.2646 0.7470 0.4802 1.8093 1.3655 1.1547 3.9505 0.4574 6.8824 1.3537 0.4493 5.7053 7.4945 2.5886 0.3051 13.2144 52.9562 18.8858 37.3651 25.4864 7.5989 15.1658 0.6284 42.8485 34.7206 18.2721 4.6383 85.8940 21.0878 15.9183 7.3155 4.8000 1.7579 2.1567 0.2676 5.9078 2.8196 10.3108 31.3649 2.0927 7.0478 6.2946 36.4098 0.5667 49.5164 623.1027 48.4885 282.6272 2.8570 47.8659 150.7479 50.5164 5.2136 14.1065 12.1333 54.5443 6.5402 15.8706 4.4330 15.9595 128.7877 12.8303 30.2546 223.0349 10.8362 365.6125 92.4537 33.4892 18.0597 0.4693 3.4618 17.1320 16.9073 4.6114 21.8630 0.3274 7.2667 224.9538
temp: 298.150 k
press: 1.00000 atm
elementType: 8 8 8 7 7 6 6 6 6 6 6 6 6 6 6 6 6 6 6 1 1 1 1 1 1 1 1 1 1 1 1
symmnumber: 1
zpe: 613754.4 jmol-1
zpe.correction: 0.233767 hartree
zpe.thermalcorrener: 0.249938 hartree
zpe.thermalcorrenthalpy: 0.250883 hartree
zpe.thermalcorrgfe: 0.189238 hartree
zpe.sumelectzpe: -874.461957 hartree
zpe.sumelectthermal: -874.445785 hartree
zpe.sumelectthermalent: -874.444841 hartree
zpe.sumelectthermalfe: -874.506486 hartree
dipole: 0.6630 5.6155 1.1392
dipole: 5.7681
quadrupole: -94.2020 -121.3076 -109.1182
quadrupole: -25.8793 -2.9955 -3.9732
quadrupole: 14.0073 -13.0983 -0.9089 -25.8793 -2.9955 -3.9732
hfenergy: -874.6957236 hartree
pointgroup: C01 [X(C14H12N2O3)]
dipole: -0.4881482 2.1490195 -0.541652 debye
polarizability: 260.6936114|9.5813186|247.9224156|-9.0829703|3.0786034|92.7258478 unknown
InChI: InChI=1S/C14H12N2O3/c1-15-13-8-7-11(16(18)19)9-12(13)14(17)10-5-3-2-4-6-10/h2-9,15H,1H3
charge 0 multiplicity 1
31 atoms
O  -1.295879 2.418381 0.230203
O  3.65934 -2.830751 0.322405
O  1.438079 -3.301139 0.591413
N  1.20936 3.037482 -0.168848
N  2.413748 -2.472963 0.38012
C  0.413417 0.726253 0.064849
C  1.492142 1.700971 -0.099843
C  -1.002802 1.168679 0.088895
C  0.75568 -0.635813 0.241436
C  -2.138783 0.200759 -0.063402
C  2.846388 1.22444 -0.184431
C  2.095873 -1.055655 0.190784
C  3.147535 -0.128074 -0.042044
C  -2.09854 -0.910915 -0.949094
C  -3.342074 0.481243 0.640202
C  2.20598 4.086935 -0.382292
C  -3.233095 -1.736037 -1.107016
C  -4.466788 -0.353876 0.494292
C  -4.414882 -1.467554 -0.378912
H  -0.014025 -1.383671 0.4459
H  3.657046 1.940576 -0.341693
H  4.176604 -0.494779 -0.088579
H  0.206355 3.265725 -0.012598
H  -1.200093 -1.111649 -1.541627
H  -3.374544 1.360303 1.291913
H  2.956068 4.114856 0.432324
H  1.692507 5.060706 -0.407502
H  2.741875 3.956515 -1.342274
H  -3.194175 -2.584231 -1.798641
H  -5.383194 -0.138235 1.054102
H  -5.290721 -2.115181 -0.496345
