program: Gaussian 09
title: 000078643
version: EM64L-G09RevD.01
frameworkgroup: C1[X(C10H11N5)]
method: RPBEPBE
basis: SDD
operation: Freq
keyword: #pfreq=noraman
keyword: PBEPBE/SDD
title: #p freq=noraman PBEPBE/SDD
converged: YES YES NO NO
title: Mulliken charges:
elementType: N N N N N C C C C C C C C C C H H H H H H H H H H H
charge: -0.434868 0.029284 0.029285 -0.695110 -0.695102 0.168967 0.169035 -0.354333 -0.354341 0.447019 0.447029 -0.296010 -0.296033 -0.490733 -0.490734 0.291764 0.209687 0.209709 0.221464 0.221471 0.227517 0.227508 0.304381 0.299378 0.299383 0.304385
chargesum: 0.00000
title: Mulliken charges with hydrogens summed into heavy atoms:
elementType: N N N N N C C C C C C C C C C
charge: -0.143104 0.029284 0.029285 -0.091352 -0.091335 0.168967 0.169035 -0.144646 -0.144632 0.447019 0.447029 -0.074546 -0.074562 -0.263216 -0.263226
polarizability: 2.98037538e+02 -1.22020570e-03 1.49552803e+02 2.20732974e-02 -5.31655636e-02 5.76586722e+01
1716.lowfreq: -37.4659 -11.1908 -9.0965 -0.0008 -0.0007 -0.0006 1.7254 36.8134 79.8047
frequency: -37.4477 36.7655 79.8047 100.2897 150.6260 234.0046 260.9194 273.2747 275.0293 334.5803 336.1199 351.6223 356.5067 357.4518 383.8477 412.6936 419.8659 506.4796 507.8613 515.5776 539.5712 607.9412 625.8336 630.2791 743.4755 749.3361 792.2254 798.7050 804.5300 806.1720 830.2350 881.7236 882.2527 892.0590 926.3149 926.9615 980.2226 981.1255 1020.2306 1024.8733 1146.1545 1153.4708 1214.8057 1232.4758 1306.4004 1310.1149 1317.2185 1329.8572 1336.8744 1362.9434 1393.1583 1393.1888 1481.8515 1498.7034 1507.5895 1545.0479 1580.9858 1619.2676 1619.5204 1639.0801 1639.3527 3091.6806 3092.4743 3108.3601 3108.9482 3136.7314 3137.1377 3555.0922 3569.7127 3570.2117 3709.2748 3709.2968
redmass: 4.2055 5.6359 5.3524 5.1002 3.9829 4.9371 6.3473 1.1629 1.1647 1.4206 1.2291 2.4562 2.6590 2.9206 3.0629 3.4382 3.8522 2.4500 6.9512 2.3378 1.2887 6.4280 6.9904 8.3528 4.6335 4.2135 6.3509 6.4570 1.5659 1.6331 7.0018 1.4979 1.4903 5.5301 1.3625 1.3541 2.9029 3.0939 1.4844 1.4525 1.2571 1.1655 1.7516 2.7619 1.8468 3.1238 1.7164 3.2576 5.0921 2.8467 2.5256 2.7462 4.6295 3.7115 2.3117 5.8082 2.4300 2.9237 3.3330 1.3960 1.4744 1.0904 1.0907 1.0878 1.0879 1.0972 1.0973 1.0749 1.0444 1.0446 1.1042 1.1042
irintensity: 0.0004 8.7892 3.6096 0.0001 5.0386 1.3515 2.6855 0.0200 509.1676 0.0043 101.5961 0.0004 46.9837 3.2014 0.1538 0.0001 13.2868 0.0004 13.4556 31.1447 58.1341 5.6079 0.4588 5.4372 3.6066 0.0006 0.1592 30.7167 138.5430 0.0050 0.0215 0.0259 25.7456 5.7862 0.0001 0.0407 12.2481 5.5359 1.1199 13.7159 8.4746 18.1703 25.4195 4.2430 227.1915 23.4270 1.0876 0.8850 36.5280 9.5432 42.6375 3.6916 1479.2309 77.7927 10.2837 0.5716 313.7764 38.4652 1.9878 46.3691 227.2253 42.4458 68.9836 32.5223 14.1920 30.3764 26.2424 13.8035 153.2558 16.3408 11.8556 25.9700
temp: 298.150 k
press: 1.00000 atm
elementType: 7 7 7 7 7 6 6 6 6 6 6 6 6 6 6 1 1 1 1 1 1 1 1 1 1 1
symmnumber: 1
zpe: 530869.0 jmol-1
zpe.correction: 0.202197 hartree
zpe.thermalcorrener: 0.215130 hartree
zpe.thermalcorrenthalpy: 0.216074 hartree
zpe.thermalcorrgfe: 0.163027 hartree
zpe.sumelectzpe: -660.348414 hartree
zpe.sumelectthermal: -660.335481 hartree
zpe.sumelectthermalent: -660.334537 hartree
zpe.sumelectthermalfe: -660.387584 hartree
dipole: -0.0007 2.0286 -0.0146
dipole: 2.0286
quadrupole: -36.6217 -72.4146 -95.8569
quadrupole: 0.0011 0.0208 0.0205
quadrupole: 31.6761 -4.1169 -27.5592 0.0011 0.0208 0.0205
hfenergy: -660.5506115 hartree
pointgroup: C01 [X(C10H11N5)]
dipole: -0.0002266 -0.7981152 0.0040931 debye
dipolederiv: -2.7036139 -0.0002064 -0.0001866 -0.0002508 -0.178741 0.0016118 0.0005683 -0.0010831 -0.369146 -0.3639965 0.1788874 -0.0000829 -0.5614314 -0.1583292 -0.0006757 -0.0041052 0.0003843 -0.1948176 -0.3639696 -0.1788796 0.0011173 0.5614196 -0.1581694 -0.0009267 0.0032335 0.0004475 -0.1947947 -1.7303856 -0.496126 -0.0020489 -0.6636037 -0.2612059 0.0004741 -0.0035183 0.0003052 -0.7680982 -1.7303825 0.4960993 0.0006945 0.6635976 -0.261185 -0.0013924 0.0016956 -0.0014546 -0.7680836 2.078199 0.3716209 0.0038176 0.8846615 -0.0109063 0.0000529 0.0063859 0.0014478 0.1211783 2.0782786 -0.3713808 -0.0034199 -0.8843391 -0.0111616 0.0000395 -0.0082065 0.0017067 0.1211562 -0.4791649 -0.2969399 -0.0008395 0.2885287 0.0666637 0.0003426 0.0003414 -0.0004784 -0.1738958 -0.479263 0.2968631 -0.0001559 -0.2886518 0.0666299 -0.0002139 0.0003347 -0.0012769 -0.1738948 1.6112198 0.6829551 0.0029889 0.5122864 -0.1019341 0.0002316 0.0035285 0.0003319 0.153096 1.6111667 -0.6829193 -0.0017515 -0.5123511 -0.1019336 0.0015897 -0.0034265 0.0019297 0.1531045 0.0512437 0.1276032 0.0007601 -0.3716919 0.1372284 0.000089 0.000427 0.0007813 -0.194241 0.0512544 -0.127608 -0.000483 0.3717432 0.1371769 -0.0012324 -0.0020006 -0.0001671 -0.1942619 -0.2555124 -0.3900202 -0.0003472 0.4724876 0.3842408 0.0020003 0.0014846 0.0006141 -0.1579138 -0.2554387 0.3899918 -0.0012029 -0.4724605 0.3842526 0.0006362 0.0006263 -0.0012926 -0.1578771 0.123997 0.0000029 0.0000302 0.0000059 0.1052985 -0.0010734 0.000933 -0.0012907 0.3050778 0.0776786 -0.0629064 -0.0002852 -0.0445068 -0.1416314 -0.0005118 -0.0006437 -0.0002025 0.1649446 0.0776913 0.0629373 0.0002431 0.0445455 -0.1415654 0.000397 0.0007378 0.0006812 0.1649551 -0.1055282 0.1054626 -0.0002123 0.1049168 0.0184401 -0.0001014 -0.0004032 -0.0000815 0.1601932 -0.1054918 -0.1054618 0.0007386 -0.104934 0.0184212 0.0004071 0.001035 0.0003581 0.1602023 0.0267047 -0.0635525 -0.0003225 -0.1199924 -0.1457198 -0.0008921 -0.0005802 -0.0007699 0.1342205 0.0266738 0.0635927 0.0001792 0.120004 -0.1457123 -0.0001077 0.0002089 -0.0000739 0.1342049 0.1811017 0.0434129 -0.0002026 0.0840089 0.1381523 -0.0005035 -0.0000143 -0.0004539 0.3944149 0.1982011 0.0216402 -0.0002371 -0.0046779 0.1117644 -0.0006731 -0.0000911 -0.0006568 0.3929309 0.1982178 -0.0216363 0.0006255 0.0046908 0.1117705 0.0002254 0.0007025 0.0001597 0.3929343 0.1811186 -0.0434322 0.0005828 -0.0840053 0.1381558 0.0002067 0.0007465 0.0001346 0.394411 unknown
polarizability: 298.0375388|0.0076788|149.5526254|-0.0181059|0.1383795|57.6588492 unknown
InChI: InChI=1S/C10H11N5/c11-7-1-3-9(13-5-7)15-10-4-2-8(12)6-14-10/h1-6,15H,11-12H2
charge 0 multiplicity 1
26 atoms
N  -0.000243 -1.114037 -0.011656
N  1.480803 0.796927 -0.003398
N  -1.481418 0.796779 -0.007418
N  5.202863 1.025475 0.00372
N  -5.203459 1.025114 0.00272
C  1.294785 -0.550983 -0.00694
C  -1.295401 -0.551167 -0.007016
C  2.404513 -1.453221 -0.0063
C  -2.404961 -1.453465 -0.002682
C  3.921278 0.466389 0.000451
C  -3.921889 0.46602 -0.000128
C  3.712021 -0.944277 -0.002968
C  -3.712553 -0.944607 0.000319
C  2.751504 1.27697 0.000573
C  -2.752139 1.276703 -0.00356
H  -0.000179 -2.134733 -0.019095
H  2.243411 -2.538581 -0.007766
H  -2.243742 -2.538791 -0.001003
H  4.566896 -1.631152 -0.002592
H  -4.567341 -1.631585 0.003506
H  2.842001 2.372422 0.003855
H  -2.8428 2.372154 -0.00347
H  5.325713 2.033359 0.006115
H  6.031089 0.438568 0.003296
H  -6.031685 0.438216 0.00538
H  -5.326267 2.033005 0.002657
