program: Gaussian 09
title: 000078642
version: EM64L-G09RevD.01
frameworkgroup: C1[X(C7H11N3)]
method: RPBEPBE
basis: SDD
operation: Freq
keyword: #pfreq=noraman
keyword: PBEPBE/SDD
title: #p freq=noraman PBEPBE/SDD
converged: YES YES NO NO
title: Mulliken charges:
elementType: N N N C C C C C C C H H H H H H H H H H H
charge: -0.137200 -0.089870 -0.698915 0.215528 -0.276179 -0.656514 -0.654579 -0.323755 0.439057 -0.493167 0.232461 0.232167 0.229107 0.225685 0.292100 0.213576 0.213022 0.217471 0.221993 0.299911 0.298101
chargesum: 0.00000
title: Mulliken charges with hydrogens summed into heavy atoms:
elementType: N N N C C C C C C C
charge: -0.137200 -0.089870 -0.100903 0.215528 -0.043718 0.030445 0.064119 -0.106284 0.439057 -0.271174
polarizability: 1.57029033e+02 -1.74567162e+00 9.69710266e+01 -2.96326959e-01 2.95566464e-01 5.09822287e+01
1716.lowfreq: -13.3141 -8.9547 0.0005 0.0007 0.0009 12.4133 40.3475 81.2932 110.2450
frequency: 40.1330 81.1133 110.2424 167.9730 203.4901 214.7768 227.5530 296.5541 340.9499 352.2015 360.9257 417.9606 476.7010 504.8395 512.2329 636.2001 696.0331 742.4650 796.3742 813.6787 879.2298 922.6514 955.3300 982.2179 1021.0737 1064.6978 1099.6614 1132.4768 1147.8537 1175.4566 1234.9944 1304.5418 1314.6011 1338.6198 1381.2485 1404.8992 1416.0446 1446.7183 1471.4198 1474.0689 1493.6684 1496.9619 1513.7590 1554.9820 1626.3791 1641.3096 2924.6388 2942.7445 2989.5325 3009.2770 3090.2942 3092.6421 3108.0289 3120.1689 3168.0455 3573.9955 3713.5857
redmass: 1.8514 2.4359 2.2774 1.1839 2.6213 2.0132 1.2242 1.0571 3.0718 2.9543 4.9317 3.5612 3.7503 3.5611 2.4334 7.4940 4.9422 4.7094 1.6013 6.8889 1.4724 1.3531 3.0467 2.7298 1.4781 1.4164 1.2260 1.3296 1.3520 1.8836 2.6973 2.2217 1.9341 3.9755 3.7665 2.0193 1.3099 1.3146 1.0457 1.2547 1.0550 1.1281 2.5253 4.4447 1.7594 2.2045 1.0399 1.0391 1.0982 1.1001 1.0944 1.0906 1.0949 1.0899 1.0941 1.0445 1.1042
irintensity: 5.3209 3.0634 2.2250 1.0761 2.6746 2.9481 303.3727 37.9701 1.9692 3.9181 0.7606 3.3863 3.5669 5.4106 8.3520 1.5729 8.2526 1.1890 55.7836 12.5574 14.8272 0.4555 68.7338 3.8058 9.7841 31.1697 0.1415 3.4909 5.3937 55.6455 23.8855 79.6275 5.0910 45.2956 3.4431 66.6060 22.8261 37.2978 15.3639 120.8907 10.0450 2.5210 274.2359 227.5917 120.6817 40.0522 93.2048 162.2241 55.5935 58.3961 25.0170 48.3111 1.3260 26.9175 15.8766 60.1021 18.3841
temp: 298.150 k
press: 1.00000 atm
elementType: 7 7 7 6 6 6 6 6 6 6 1 1 1 1 1 1 1 1 1 1 1
symmnumber: 1
zpe: 455898.1 jmol-1
zpe.correction: 0.173642 hartree
zpe.thermalcorrener: 0.184471 hartree
zpe.thermalcorrenthalpy: 0.185415 hartree
zpe.thermalcorrgfe: 0.137238 hartree
zpe.sumelectzpe: -436.830669 hartree
zpe.sumelectthermal: -436.819841 hartree
zpe.sumelectthermalent: -436.818896 hartree
zpe.sumelectthermalfe: -436.867073 hartree
dipole: 0.9602 1.7645 0.0789
dipole: 2.0104
quadrupole: -39.6735 -56.3611 -65.0460
quadrupole: -1.6551 -0.0595 0.0134
quadrupole: 14.0201 -2.6676 -11.3525 -1.6551 -0.0595 0.0134
hfenergy: -437.0043118 hartree
pointgroup: C01 [X(C7H11N3)]
dipole: 0.3854496 -0.6833816 -0.1000471 debye
dipolederiv: -1.7365951 -0.0407359 -0.0482064 0.1300413 -0.485612 -0.0174985 0.0924121 -0.0152222 -0.3243792 -0.6891663 0.35217 0.0337777 -0.4043776 -0.2287426 -0.0073193 -0.0425339 0.010058 -0.2401915 -1.6717255 -0.0737896 -0.0320384 -0.0437169 -0.0618531 0.0879669 -0.0237705 0.0874593 -0.7656879 1.9448233 -0.0043019 0.0318385 -0.1333706 -0.2530734 -0.044314 -0.0176538 -0.0424247 0.1112194 -0.4066056 -0.2737526 -0.0365508 0.4950468 0.0415678 0.0453781 0.0526139 0.0256379 -0.1892579 0.3094812 0.1672771 0.0290187 0.4707772 0.4399228 0.0549101 0.0542548 0.0439328 0.3090398 0.2459812 -0.2688826 -0.0160389 -0.5514879 0.3072167 -0.0352868 -0.0822537 -0.0264763 0.2809125 0.0338265 0.2648295 0.0355326 -0.2741416 0.2308571 0.0463335 -0.0324915 0.0588285 -0.1796508 1.5542199 0.1270719 0.0511274 -0.0855939 -0.4435932 -0.073529 0.0223533 -0.0681672 0.121141 0.0637294 -0.3591778 -0.0418486 0.4872172 0.3994788 0.0798005 0.0612872 0.0601306 -0.1490313 0.0449895 -0.0927792 -0.015576 -0.0977473 -0.0639152 -0.0324973 -0.0151743 -0.0332673 0.1592974 -0.1633176 0.0062792 0.0108871 0.0863634 0.0912709 -0.0127136 0.0213865 -0.0099467 0.1101851 0.0975066 0.0761342 -0.0636227 -0.1018114 -0.1183875 0.0976356 0.0002495 0.126094 -0.0599505 0.0738185 0.0366566 0.065196 -0.1284847 -0.0606359 -0.0967036 -0.0663431 -0.1393509 -0.1544163 0.1967392 -0.1371772 -0.021233 -0.0419729 0.0170078 -0.0143879 -0.0084811 -0.0196463 0.1180222 -0.1379263 0.091758 0.1340996 0.0645749 0.0627672 0.0355713 0.1895371 -0.017207 -0.0815992 -0.0945963 0.1150136 -0.1020208 0.1419925 0.0408097 0.0113417 -0.1868104 0.0830071 -0.1322093 -0.0118835 0.1131293 0.0109351 0.1119711 -0.0561977 -0.024703 0.0115059 -0.0247789 0.1532051 -0.0347848 -0.1161854 -0.017981 -0.1374889 -0.0839305 -0.0298515 -0.0220178 -0.0287668 0.1323309 0.1987798 0.020325 -0.0019655 0.0303376 0.1157343 -0.0341404 -0.0013959 -0.0343641 0.3911769 0.1827059 -0.0038625 -0.0053305 -0.0181283 0.1093081 -0.0359929 -0.0066743 -0.0355298 0.3898436 unknown
polarizability: 156.913264|2.0153244|96.3412443|3.06235|5.5262909|51.7277795 unknown
InChI: InChI=1S/C7H11N3/c1-10(2)7-4-3-6(8)5-9-7/h3-5H,8H2,1-2H3
charge 0 multiplicity 1
21 atoms
N  -2.090441 -0.012132 0.023879
N  -0.030772 1.154014 0.191235
N  3.5382 0.079972 0.137675
C  -0.689905 -0.038323 0.033984
C  0.044724 -1.259578 -0.108558
C  -2.84681 -1.251125 -0.153471
C  -2.825661 1.256513 0.09047
C  1.449795 -1.228068 -0.073655
C  2.138804 0.006453 0.09706
C  1.325815 1.166927 0.220727
H  -0.466941 -2.215114 -0.248086
H  -3.92331 -1.027615 -0.07629
H  -2.601304 -1.999877 0.627674
H  -2.667773 -1.721576 -1.144682
H  -2.094233 2.063498 0.246892
H  -3.548201 1.253171 0.930821
H  -3.382287 1.454956 -0.849069
H  2.014688 -2.16243 -0.182264
H  1.790612 2.154484 0.348907
H  4.005857 0.972421 0.260222
H  4.107743 -0.75497 0.046829
